hadoop-yarn-dev mailing list archives

Site index · List index
Message view « Date » · « Thread »
Top « Date » · « Thread »
From Apache Jenkins Server <jenk...@builds.apache.org>
Subject Build failed in Jenkins: Hadoop-Yarn-trunk-Java8 #302
Date Mon, 24 Aug 2015 05:48:40 GMT
See <https://builds.apache.org/job/Hadoop-Yarn-trunk-Java8/302/changes>

Changes:

[aajisaka] HDFS-8942. Update hyperlink to rack awareness page in HDFS Architecture documentation.
Contributed by Masatake Iwasaki.

------------------------------------------
[...truncated 4497 lines...]
	at org.apache.hadoop.fs.AbstractFileSystem.createFileSystem(AbstractFileSystem.java:161)
	at org.apache.hadoop.fs.AbstractFileSystem.get(AbstractFileSystem.java:250)
	at org.apache.hadoop.fs.FileContext$2.run(FileContext.java:329)
	at org.apache.hadoop.fs.FileContext$2.run(FileContext.java:326)
	at java.security.AccessController.doPrivileged(Native Method)
	at javax.security.auth.Subject.doAs(Subject.java:422)
	at org.apache.hadoop.security.UserGroupInformation.doAs(UserGroupInformation.java:1667)
	at org.apache.hadoop.fs.FileContext.getAbstractFileSystem(FileContext.java:326)
	at org.apache.hadoop.fs.FileContext.getFileContext(FileContext.java:443)
	at org.apache.hadoop.fs.FileContext.getFileContext(FileContext.java:420)
	at org.apache.hadoop.fs.FileContext.getLocalFSFileContext(FileContext.java:406)
	at org.apache.hadoop.yarn.server.nodemanager.containermanager.BaseContainerManagerTest.<init>(BaseContainerManagerTest.java:91)
	at org.apache.hadoop.yarn.server.nodemanager.containermanager.TestContainerManager.<init>(TestContainerManager.java:94)

testLocalFilesCleanup(org.apache.hadoop.yarn.server.nodemanager.containermanager.TestContainerManager)
 Time elapsed: 0.001 sec  <<< ERROR!
org.apache.hadoop.fs.UnsupportedFileSystemException: fs.AbstractFileSystem.file.impl=null:
No AbstractFileSystem configured for scheme: file
	at org.apache.hadoop.fs.AbstractFileSystem.createFileSystem(AbstractFileSystem.java:161)
	at org.apache.hadoop.fs.AbstractFileSystem.get(AbstractFileSystem.java:250)
	at org.apache.hadoop.fs.FileContext$2.run(FileContext.java:329)
	at org.apache.hadoop.fs.FileContext$2.run(FileContext.java:326)
	at java.security.AccessController.doPrivileged(Native Method)
	at javax.security.auth.Subject.doAs(Subject.java:422)
	at org.apache.hadoop.security.UserGroupInformation.doAs(UserGroupInformation.java:1667)
	at org.apache.hadoop.fs.FileContext.getAbstractFileSystem(FileContext.java:326)
	at org.apache.hadoop.fs.FileContext.getFileContext(FileContext.java:443)
	at org.apache.hadoop.fs.FileContext.getFileContext(FileContext.java:420)
	at org.apache.hadoop.fs.FileContext.getLocalFSFileContext(FileContext.java:406)
	at org.apache.hadoop.yarn.server.nodemanager.containermanager.BaseContainerManagerTest.<init>(BaseContainerManagerTest.java:91)
	at org.apache.hadoop.yarn.server.nodemanager.containermanager.TestContainerManager.<init>(TestContainerManager.java:94)

testContainerLaunchFromPreviousRM(org.apache.hadoop.yarn.server.nodemanager.containermanager.TestContainerManager)
 Time elapsed: 0 sec  <<< ERROR!
org.apache.hadoop.fs.UnsupportedFileSystemException: fs.AbstractFileSystem.file.impl=null:
No AbstractFileSystem configured for scheme: file
	at org.apache.hadoop.fs.AbstractFileSystem.createFileSystem(AbstractFileSystem.java:161)
	at org.apache.hadoop.fs.AbstractFileSystem.get(AbstractFileSystem.java:250)
	at org.apache.hadoop.fs.FileContext$2.run(FileContext.java:329)
	at org.apache.hadoop.fs.FileContext$2.run(FileContext.java:326)
	at java.security.AccessController.doPrivileged(Native Method)
	at javax.security.auth.Subject.doAs(Subject.java:422)
	at org.apache.hadoop.security.UserGroupInformation.doAs(UserGroupInformation.java:1667)
	at org.apache.hadoop.fs.FileContext.getAbstractFileSystem(FileContext.java:326)
	at org.apache.hadoop.fs.FileContext.getFileContext(FileContext.java:443)
	at org.apache.hadoop.fs.FileContext.getFileContext(FileContext.java:420)
	at org.apache.hadoop.fs.FileContext.getLocalFSFileContext(FileContext.java:406)
	at org.apache.hadoop.yarn.server.nodemanager.containermanager.BaseContainerManagerTest.<init>(BaseContainerManagerTest.java:91)
	at org.apache.hadoop.yarn.server.nodemanager.containermanager.TestContainerManager.<init>(TestContainerManager.java:94)

testNullTokens(org.apache.hadoop.yarn.server.nodemanager.containermanager.TestContainerManager)
 Time elapsed: 0.001 sec  <<< ERROR!
org.apache.hadoop.fs.UnsupportedFileSystemException: fs.AbstractFileSystem.file.impl=null:
No AbstractFileSystem configured for scheme: file
	at org.apache.hadoop.fs.AbstractFileSystem.createFileSystem(AbstractFileSystem.java:161)
	at org.apache.hadoop.fs.AbstractFileSystem.get(AbstractFileSystem.java:250)
	at org.apache.hadoop.fs.FileContext$2.run(FileContext.java:329)
	at org.apache.hadoop.fs.FileContext$2.run(FileContext.java:326)
	at java.security.AccessController.doPrivileged(Native Method)
	at javax.security.auth.Subject.doAs(Subject.java:422)
	at org.apache.hadoop.security.UserGroupInformation.doAs(UserGroupInformation.java:1667)
	at org.apache.hadoop.fs.FileContext.getAbstractFileSystem(FileContext.java:326)
	at org.apache.hadoop.fs.FileContext.getFileContext(FileContext.java:443)
	at org.apache.hadoop.fs.FileContext.getFileContext(FileContext.java:420)
	at org.apache.hadoop.fs.FileContext.getLocalFSFileContext(FileContext.java:406)
	at org.apache.hadoop.yarn.server.nodemanager.containermanager.BaseContainerManagerTest.<init>(BaseContainerManagerTest.java:91)
	at org.apache.hadoop.yarn.server.nodemanager.containermanager.TestContainerManager.<init>(TestContainerManager.java:94)

testContainerLaunchAndExitSuccess(org.apache.hadoop.yarn.server.nodemanager.containermanager.TestContainerManager)
 Time elapsed: 0.001 sec  <<< ERROR!
org.apache.hadoop.fs.UnsupportedFileSystemException: fs.AbstractFileSystem.file.impl=null:
No AbstractFileSystem configured for scheme: file
	at org.apache.hadoop.fs.AbstractFileSystem.createFileSystem(AbstractFileSystem.java:161)
	at org.apache.hadoop.fs.AbstractFileSystem.get(AbstractFileSystem.java:250)
	at org.apache.hadoop.fs.FileContext$2.run(FileContext.java:329)
	at org.apache.hadoop.fs.FileContext$2.run(FileContext.java:326)
	at java.security.AccessController.doPrivileged(Native Method)
	at javax.security.auth.Subject.doAs(Subject.java:422)
	at org.apache.hadoop.security.UserGroupInformation.doAs(UserGroupInformation.java:1667)
	at org.apache.hadoop.fs.FileContext.getAbstractFileSystem(FileContext.java:326)
	at org.apache.hadoop.fs.FileContext.getFileContext(FileContext.java:443)
	at org.apache.hadoop.fs.FileContext.getFileContext(FileContext.java:420)
	at org.apache.hadoop.fs.FileContext.getLocalFSFileContext(FileContext.java:406)
	at org.apache.hadoop.yarn.server.nodemanager.containermanager.BaseContainerManagerTest.<init>(BaseContainerManagerTest.java:91)
	at org.apache.hadoop.yarn.server.nodemanager.containermanager.TestContainerManager.<init>(TestContainerManager.java:94)

testMultipleContainersLaunch(org.apache.hadoop.yarn.server.nodemanager.containermanager.TestContainerManager)
 Time elapsed: 0.001 sec  <<< ERROR!
org.apache.hadoop.fs.UnsupportedFileSystemException: fs.AbstractFileSystem.file.impl=null:
No AbstractFileSystem configured for scheme: file
	at org.apache.hadoop.fs.AbstractFileSystem.createFileSystem(AbstractFileSystem.java:161)
	at org.apache.hadoop.fs.AbstractFileSystem.get(AbstractFileSystem.java:250)
	at org.apache.hadoop.fs.FileContext$2.run(FileContext.java:329)
	at org.apache.hadoop.fs.FileContext$2.run(FileContext.java:326)
	at java.security.AccessController.doPrivileged(Native Method)
	at javax.security.auth.Subject.doAs(Subject.java:422)
	at org.apache.hadoop.security.UserGroupInformation.doAs(UserGroupInformation.java:1667)
	at org.apache.hadoop.fs.FileContext.getAbstractFileSystem(FileContext.java:326)
	at org.apache.hadoop.fs.FileContext.getFileContext(FileContext.java:443)
	at org.apache.hadoop.fs.FileContext.getFileContext(FileContext.java:420)
	at org.apache.hadoop.fs.FileContext.getLocalFSFileContext(FileContext.java:406)
	at org.apache.hadoop.yarn.server.nodemanager.containermanager.BaseContainerManagerTest.<init>(BaseContainerManagerTest.java:91)
	at org.apache.hadoop.yarn.server.nodemanager.containermanager.TestContainerManager.<init>(TestContainerManager.java:94)

testMultipleContainersStopAndGetStatus(org.apache.hadoop.yarn.server.nodemanager.containermanager.TestContainerManager)
 Time elapsed: 0.001 sec  <<< ERROR!
org.apache.hadoop.fs.UnsupportedFileSystemException: fs.AbstractFileSystem.file.impl=null:
No AbstractFileSystem configured for scheme: file
	at org.apache.hadoop.fs.AbstractFileSystem.createFileSystem(AbstractFileSystem.java:161)
	at org.apache.hadoop.fs.AbstractFileSystem.get(AbstractFileSystem.java:250)
	at org.apache.hadoop.fs.FileContext$2.run(FileContext.java:329)
	at org.apache.hadoop.fs.FileContext$2.run(FileContext.java:326)
	at java.security.AccessController.doPrivileged(Native Method)
	at javax.security.auth.Subject.doAs(Subject.java:422)
	at org.apache.hadoop.security.UserGroupInformation.doAs(UserGroupInformation.java:1667)
	at org.apache.hadoop.fs.FileContext.getAbstractFileSystem(FileContext.java:326)
	at org.apache.hadoop.fs.FileContext.getFileContext(FileContext.java:443)
	at org.apache.hadoop.fs.FileContext.getFileContext(FileContext.java:420)
	at org.apache.hadoop.fs.FileContext.getLocalFSFileContext(FileContext.java:406)
	at org.apache.hadoop.yarn.server.nodemanager.containermanager.BaseContainerManagerTest.<init>(BaseContainerManagerTest.java:91)
	at org.apache.hadoop.yarn.server.nodemanager.containermanager.TestContainerManager.<init>(TestContainerManager.java:94)

Java HotSpot(TM) 64-Bit Server VM warning: ignoring option MaxPermSize=768m; support was removed
in 8.0
Running org.apache.hadoop.yarn.server.nodemanager.containermanager.logaggregation.TestLogAggregationService
Tests run: 34, Failures: 0, Errors: 0, Skipped: 0, Time elapsed: 106.745 sec - in org.apache.hadoop.yarn.server.nodemanager.containermanager.logaggregation.TestLogAggregationService
Java HotSpot(TM) 64-Bit Server VM warning: ignoring option MaxPermSize=768m; support was removed
in 8.0
Running org.apache.hadoop.yarn.server.nodemanager.containermanager.TestNMProxy
Tests run: 2, Failures: 0, Errors: 0, Skipped: 0, Time elapsed: 3.816 sec - in org.apache.hadoop.yarn.server.nodemanager.containermanager.TestNMProxy
Java HotSpot(TM) 64-Bit Server VM warning: ignoring option MaxPermSize=768m; support was removed
in 8.0
Running org.apache.hadoop.yarn.server.nodemanager.containermanager.TestContainerManagerRecovery
Tests run: 2, Failures: 0, Errors: 0, Skipped: 0, Time elapsed: 9.878 sec - in org.apache.hadoop.yarn.server.nodemanager.containermanager.TestContainerManagerRecovery
Java HotSpot(TM) 64-Bit Server VM warning: ignoring option MaxPermSize=768m; support was removed
in 8.0
Running org.apache.hadoop.yarn.server.nodemanager.containermanager.monitor.TestContainerMetrics
Tests run: 2, Failures: 0, Errors: 0, Skipped: 0, Time elapsed: 0.88 sec - in org.apache.hadoop.yarn.server.nodemanager.containermanager.monitor.TestContainerMetrics
Java HotSpot(TM) 64-Bit Server VM warning: ignoring option MaxPermSize=768m; support was removed
in 8.0
Running org.apache.hadoop.yarn.server.nodemanager.containermanager.monitor.TestContainersMonitor
Tests run: 3, Failures: 0, Errors: 0, Skipped: 0, Time elapsed: 6.958 sec - in org.apache.hadoop.yarn.server.nodemanager.containermanager.monitor.TestContainersMonitor
Java HotSpot(TM) 64-Bit Server VM warning: ignoring option MaxPermSize=768m; support was removed
in 8.0
Running org.apache.hadoop.yarn.server.nodemanager.containermanager.TestAuxServices
Tests run: 6, Failures: 0, Errors: 0, Skipped: 0, Time elapsed: 0.807 sec - in org.apache.hadoop.yarn.server.nodemanager.containermanager.TestAuxServices
Java HotSpot(TM) 64-Bit Server VM warning: ignoring option MaxPermSize=768m; support was removed
in 8.0
Running org.apache.hadoop.yarn.server.nodemanager.containermanager.loghandler.TestNonAggregatingLogHandler
Tests run: 6, Failures: 0, Errors: 0, Skipped: 0, Time elapsed: 1.35 sec - in org.apache.hadoop.yarn.server.nodemanager.containermanager.loghandler.TestNonAggregatingLogHandler
Java HotSpot(TM) 64-Bit Server VM warning: ignoring option MaxPermSize=768m; support was removed
in 8.0
Running org.apache.hadoop.yarn.server.nodemanager.containermanager.launcher.TestContainerLaunch
Tests run: 17, Failures: 0, Errors: 0, Skipped: 5, Time elapsed: 20.236 sec - in org.apache.hadoop.yarn.server.nodemanager.containermanager.launcher.TestContainerLaunch
Java HotSpot(TM) 64-Bit Server VM warning: ignoring option MaxPermSize=768m; support was removed
in 8.0
Running org.apache.hadoop.yarn.server.nodemanager.containermanager.localizer.TestResourceLocalizationService
Tests run: 13, Failures: 0, Errors: 0, Skipped: 0, Time elapsed: 5.655 sec - in org.apache.hadoop.yarn.server.nodemanager.containermanager.localizer.TestResourceLocalizationService
Java HotSpot(TM) 64-Bit Server VM warning: ignoring option MaxPermSize=768m; support was removed
in 8.0
Running org.apache.hadoop.yarn.server.nodemanager.containermanager.localizer.TestLocalizedResource
Tests run: 1, Failures: 0, Errors: 0, Skipped: 0, Time elapsed: 0.573 sec - in org.apache.hadoop.yarn.server.nodemanager.containermanager.localizer.TestLocalizedResource
Java HotSpot(TM) 64-Bit Server VM warning: ignoring option MaxPermSize=768m; support was removed
in 8.0
Running org.apache.hadoop.yarn.server.nodemanager.containermanager.localizer.TestContainerLocalizer
Tests run: 3, Failures: 0, Errors: 0, Skipped: 0, Time elapsed: 1.298 sec - in org.apache.hadoop.yarn.server.nodemanager.containermanager.localizer.TestContainerLocalizer
Java HotSpot(TM) 64-Bit Server VM warning: ignoring option MaxPermSize=768m; support was removed
in 8.0
Running org.apache.hadoop.yarn.server.nodemanager.containermanager.localizer.TestLocalCacheDirectoryManager
Tests run: 5, Failures: 0, Errors: 0, Skipped: 0, Time elapsed: 1.118 sec - in org.apache.hadoop.yarn.server.nodemanager.containermanager.localizer.TestLocalCacheDirectoryManager
Java HotSpot(TM) 64-Bit Server VM warning: ignoring option MaxPermSize=768m; support was removed
in 8.0
Running org.apache.hadoop.yarn.server.nodemanager.containermanager.localizer.sharedcache.TestSharedCacheUploader
Tests run: 6, Failures: 0, Errors: 0, Skipped: 0, Time elapsed: 0.927 sec - in org.apache.hadoop.yarn.server.nodemanager.containermanager.localizer.sharedcache.TestSharedCacheUploader
Java HotSpot(TM) 64-Bit Server VM warning: ignoring option MaxPermSize=768m; support was removed
in 8.0
Running org.apache.hadoop.yarn.server.nodemanager.containermanager.localizer.sharedcache.TestSharedCacheUploadService
Tests run: 2, Failures: 0, Errors: 0, Skipped: 0, Time elapsed: 0.663 sec - in org.apache.hadoop.yarn.server.nodemanager.containermanager.localizer.sharedcache.TestSharedCacheUploadService
Java HotSpot(TM) 64-Bit Server VM warning: ignoring option MaxPermSize=768m; support was removed
in 8.0
Running org.apache.hadoop.yarn.server.nodemanager.containermanager.localizer.TestResourceRetention
Tests run: 1, Failures: 0, Errors: 0, Skipped: 0, Time elapsed: 0.742 sec - in org.apache.hadoop.yarn.server.nodemanager.containermanager.localizer.TestResourceRetention
Java HotSpot(TM) 64-Bit Server VM warning: ignoring option MaxPermSize=768m; support was removed
in 8.0
Running org.apache.hadoop.yarn.server.nodemanager.containermanager.localizer.TestLocalResource
Tests run: 2, Failures: 0, Errors: 0, Skipped: 0, Time elapsed: 0.347 sec - in org.apache.hadoop.yarn.server.nodemanager.containermanager.localizer.TestLocalResource
Java HotSpot(TM) 64-Bit Server VM warning: ignoring option MaxPermSize=768m; support was removed
in 8.0
Running org.apache.hadoop.yarn.server.nodemanager.containermanager.localizer.TestLocalResourcesTrackerImpl
Tests run: 8, Failures: 0, Errors: 0, Skipped: 0, Time elapsed: 1.091 sec - in org.apache.hadoop.yarn.server.nodemanager.containermanager.localizer.TestLocalResourcesTrackerImpl
Java HotSpot(TM) 64-Bit Server VM warning: ignoring option MaxPermSize=768m; support was removed
in 8.0
Running org.apache.hadoop.yarn.server.nodemanager.containermanager.application.TestApplication
Tests run: 8, Failures: 0, Errors: 0, Skipped: 0, Time elapsed: 5.289 sec - in org.apache.hadoop.yarn.server.nodemanager.containermanager.application.TestApplication
Java HotSpot(TM) 64-Bit Server VM warning: ignoring option MaxPermSize=768m; support was removed
in 8.0
Running org.apache.hadoop.yarn.server.nodemanager.TestContainerExecutor
Tests run: 5, Failures: 0, Errors: 0, Skipped: 3, Time elapsed: 0.662 sec - in org.apache.hadoop.yarn.server.nodemanager.TestContainerExecutor
Java HotSpot(TM) 64-Bit Server VM warning: ignoring option MaxPermSize=768m; support was removed
in 8.0
Running org.apache.hadoop.yarn.server.nodemanager.TestRecordFactory
Tests run: 1, Failures: 0, Errors: 0, Skipped: 0, Time elapsed: 0.208 sec - in org.apache.hadoop.yarn.server.nodemanager.TestRecordFactory
Java HotSpot(TM) 64-Bit Server VM warning: ignoring option MaxPermSize=768m; support was removed
in 8.0
Running org.apache.hadoop.yarn.server.nodemanager.webapp.TestContainerLogsPage
Tests run: 5, Failures: 0, Errors: 0, Skipped: 1, Time elapsed: 1.149 sec - in org.apache.hadoop.yarn.server.nodemanager.webapp.TestContainerLogsPage
Java HotSpot(TM) 64-Bit Server VM warning: ignoring option MaxPermSize=768m; support was removed
in 8.0
Running org.apache.hadoop.yarn.server.nodemanager.webapp.TestNMWebServicesContainers
Tests run: 12, Failures: 0, Errors: 0, Skipped: 0, Time elapsed: 5.731 sec - in org.apache.hadoop.yarn.server.nodemanager.webapp.TestNMWebServicesContainers
Java HotSpot(TM) 64-Bit Server VM warning: ignoring option MaxPermSize=768m; support was removed
in 8.0
Running org.apache.hadoop.yarn.server.nodemanager.webapp.TestNMWebServer
Tests run: 3, Failures: 0, Errors: 0, Skipped: 0, Time elapsed: 2.296 sec - in org.apache.hadoop.yarn.server.nodemanager.webapp.TestNMWebServer
Java HotSpot(TM) 64-Bit Server VM warning: ignoring option MaxPermSize=768m; support was removed
in 8.0
Running org.apache.hadoop.yarn.server.nodemanager.webapp.TestNMWebServices
Tests run: 11, Failures: 0, Errors: 0, Skipped: 0, Time elapsed: 5.376 sec - in org.apache.hadoop.yarn.server.nodemanager.webapp.TestNMWebServices
Java HotSpot(TM) 64-Bit Server VM warning: ignoring option MaxPermSize=768m; support was removed
in 8.0
Running org.apache.hadoop.yarn.server.nodemanager.webapp.TestNMWebServicesApps
Tests run: 19, Failures: 0, Errors: 0, Skipped: 0, Time elapsed: 7.547 sec - in org.apache.hadoop.yarn.server.nodemanager.webapp.TestNMWebServicesApps

Results :

Tests in error: 
  TestContainerManager.testContainerLaunchAndExitFailure:459->testContainerLaunchAndExit:417->createContainerToken:886->createContainerToken:902
» NoClassDefFound
  TestContainerManager>BaseContainerManagerTest.tearDown:257 » NoClassDefFound o...
  TestContainerManager.<init>:94->BaseContainerManagerTest.<init>:91 » UnsupportedFileSystem
  TestContainerManager.<init>:94->BaseContainerManagerTest.<init>:91 » UnsupportedFileSystem
  TestContainerManager.<init>:94->BaseContainerManagerTest.<init>:91 » UnsupportedFileSystem
  TestContainerManager.<init>:94->BaseContainerManagerTest.<init>:91 » UnsupportedFileSystem
  TestContainerManager.<init>:94->BaseContainerManagerTest.<init>:91 » UnsupportedFileSystem
  TestContainerManager.<init>:94->BaseContainerManagerTest.<init>:91 » UnsupportedFileSystem
  TestContainerManager.<init>:94->BaseContainerManagerTest.<init>:91 » UnsupportedFileSystem
  TestContainerManager.<init>:94->BaseContainerManagerTest.<init>:91 » UnsupportedFileSystem
  TestContainerManager.<init>:94->BaseContainerManagerTest.<init>:91 » UnsupportedFileSystem
  TestContainerManager.<init>:94->BaseContainerManagerTest.<init>:91 » UnsupportedFileSystem

Tests run: 349, Failures: 0, Errors: 12, Skipped: 17

[INFO] ------------------------------------------------------------------------
[INFO] Reactor Summary:
[INFO] 
[INFO] Apache Hadoop YARN ................................ SUCCESS [  3.220 s]
[INFO] Apache Hadoop YARN API ............................ SUCCESS [01:14 min]
[INFO] Apache Hadoop YARN Common ......................... SUCCESS [02:16 min]
[INFO] Apache Hadoop YARN Server ......................... SUCCESS [  0.065 s]
[INFO] Apache Hadoop YARN Server Common .................. SUCCESS [ 36.701 s]
[INFO] Apache Hadoop YARN NodeManager .................... FAILURE [07:00 min]
[INFO] Apache Hadoop YARN Web Proxy ...................... SKIPPED
[INFO] Apache Hadoop YARN ApplicationHistoryService ...... SKIPPED
[INFO] Apache Hadoop YARN ResourceManager ................ SKIPPED
[INFO] Apache Hadoop YARN Server Tests ................... SKIPPED
[INFO] Apache Hadoop YARN Client ......................... SKIPPED
[INFO] Apache Hadoop YARN SharedCacheManager ............. SKIPPED
[INFO] Apache Hadoop YARN Applications ................... SKIPPED
[INFO] Apache Hadoop YARN DistributedShell ............... SKIPPED
[INFO] Apache Hadoop YARN Unmanaged Am Launcher .......... SKIPPED
[INFO] Apache Hadoop YARN Site ........................... SKIPPED
[INFO] Apache Hadoop YARN Registry ....................... SKIPPED
[INFO] Apache Hadoop YARN Project ........................ SKIPPED
[INFO] ------------------------------------------------------------------------
[INFO] BUILD FAILURE
[INFO] ------------------------------------------------------------------------
[INFO] Total time: 11:12 min
[INFO] Finished at: 2015-08-24T05:49:40+00:00
[INFO] Final Memory: 86M/1048M
[INFO] ------------------------------------------------------------------------
[ERROR] Failed to execute goal org.apache.maven.plugins:maven-surefire-plugin:2.17:test (default-test)
on project hadoop-yarn-server-nodemanager: There are test failures.
[ERROR] 
[ERROR] Please refer to <https://builds.apache.org/job/Hadoop-Yarn-trunk-Java8/ws/hadoop-yarn-project/hadoop-yarn/hadoop-yarn-server/hadoop-yarn-server-nodemanager/target/surefire-reports>
for the individual test results.
[ERROR] -> [Help 1]
[ERROR] 
[ERROR] To see the full stack trace of the errors, re-run Maven with the -e switch.
[ERROR] Re-run Maven using the -X switch to enable full debug logging.
[ERROR] 
[ERROR] For more information about the errors and possible solutions, please read the following
articles:
[ERROR] [Help 1] http://cwiki.apache.org/confluence/display/MAVEN/MojoFailureException
[ERROR] 
[ERROR] After correcting the problems, you can resume the build with the command
[ERROR]   mvn <goals> -rf :hadoop-yarn-server-nodemanager
Build step 'Execute shell' marked build as failure
Archiving artifacts
Recording test results
Updating HDFS-8942

Mime
View raw message