hadoop-yarn-dev mailing list archives

Site index · List index
Message view « Date » · « Thread »
Top « Date » · « Thread »
From Apache Jenkins Server <jenk...@builds.apache.org>
Subject Failed: YARN-2923 PreCommit Build #8859
Date Mon, 17 Aug 2015 10:13:29 GMT
Jira: https://issues.apache.org/jira/browse/YARN-2923
Build: https://builds.apache.org/job/PreCommit-YARN-Build/8859/

###################################################################################
########################## LAST 60 LINES OF THE CONSOLE ###########################
[...truncated 365 lines...]
|  +1  |           findbugs  |  4m 22s    | The patch does not introduce any 
|      |                     |            | new Findbugs (version 3.0.0)
|      |                     |            | warnings.
|  +1  |         yarn tests  |  0m 23s    | Tests passed in hadoop-yarn-api. 
|  -1  |         yarn tests  |  1m 56s    | Tests failed in hadoop-yarn-common. 
|  -1  |         yarn tests  |  6m 16s    | Tests failed in 
|      |                     |            | hadoop-yarn-server-nodemanager.
|      |                     |  55m 9s    | 


             Reason | Tests
 Failed unit tests  |  hadoop.yarn.util.TestRackResolver 
                    |  hadoop.yarn.server.nodemanager.TestNodeStatusUpdaterForLabels 


|| Subsystem || Report/Notes ||
============================================================================
| Patch URL | http://issues.apache.org/jira/secure/attachment/12750760/YARN-2923.20150817-1.patch
|
| Optional Tests | javadoc javac unit findbugs checkstyle |
| git revision | trunk / 13604bd |
| checkstyle |  /home/jenkins/jenkins-slave/workspace/PreCommit-YARN-Build/patchprocess/diffcheckstylehadoop-yarn-api.txt
|
| hadoop-yarn-api test log | /home/jenkins/jenkins-slave/workspace/PreCommit-YARN-Build/patchprocess/testrun_hadoop-yarn-api.txt
|
| hadoop-yarn-common test log | /home/jenkins/jenkins-slave/workspace/PreCommit-YARN-Build/patchprocess/testrun_hadoop-yarn-common.txt
|
| hadoop-yarn-server-nodemanager test log | /home/jenkins/jenkins-slave/workspace/PreCommit-YARN-Build/patchprocess/testrun_hadoop-yarn-server-nodemanager.txt
|
| Test Results | https://builds.apache.org/job/PreCommit-YARN-Build/8859/testReport/ |
| Java | 1.7.0_55 |
| uname | Linux asf903.gq1.ygridcore.net 3.13.0-36-lowlatency #63-Ubuntu SMP PREEMPT Wed Sep
3 21:56:12 UTC 2014 x86_64 x86_64 x86_64 GNU/Linux |


============================================================================
============================================================================
                          Adding comment to JIRA
============================================================================
============================================================================


Comment added.
04f3da1e9603a7ec83465b7ac9293a88a14f5ab9 logged out


============================================================================
============================================================================
                              Finished build.
============================================================================
============================================================================


Build step 'Execute shell' marked build as failure
Archiving artifacts
Sending artifact delta relative to PreCommit-YARN-Build #8849
Archived 58 artifacts
Archive block size is 32768
Received 67 blocks and 29780208 bytes
Compression is 6.9%
Took 6.3 sec
[description-setter] Could not determine description.
Recording test results
Email was triggered for: Failure
Sending email for trigger: Failure



###################################################################################
############################## FAILED TESTS (if any) ##############################
2 tests failed.
FAILED:  org.apache.hadoop.yarn.util.TestRackResolver.testCaching

Error Message:
expected:</[default-rack]> but was:</[rack1]>

Stack Trace:
org.junit.ComparisonFailure: expected:</[default-rack]> but was:</[rack1]>
	at org.junit.Assert.assertEquals(Assert.java:115)
	at org.junit.Assert.assertEquals(Assert.java:144)
	at org.apache.hadoop.yarn.util.TestRackResolver.testCaching(TestRackResolver.java:102)


FAILED:  org.apache.hadoop.yarn.server.nodemanager.TestNodeStatusUpdaterForLabels.testNodeStatusUpdaterForNodeLabels

Error Message:
null

Stack Trace:
java.lang.NullPointerException: null
	at org.apache.hadoop.yarn.server.nodemanager.TestNodeStatusUpdaterForLabels.testNodeStatusUpdaterForNodeLabels(TestNodeStatusUpdaterForLabels.java:285)



Mime
  • Unnamed multipart/mixed (inline, None, 0 bytes)
View raw message