hadoop-yarn-dev mailing list archives

Site index · List index
Message view « Date » · « Thread »
Top « Date » · « Thread »
From Apache Jenkins Server <jenk...@builds.apache.org>
Subject Failed: YARN-3591 PreCommit Build #8787
Date Fri, 07 Aug 2015 11:21:34 GMT
Jira: https://issues.apache.org/jira/browse/YARN-3591
Build: https://builds.apache.org/job/PreCommit-YARN-Build/8787/

###################################################################################
########################## LAST 60 LINES OF THE CONSOLE ###########################
[...truncated 287 lines...]
|      |                     |            | --whitespace=fix.
|  +1  |            install  |  1m 20s    | mvn install still works. 
|  +1  |    eclipse:eclipse  |  0m 32s    | The patch built with 
|      |                     |            | eclipse:eclipse.
|  +1  |           findbugs  |  1m 13s    | The patch does not introduce any 
|      |                     |            | new Findbugs (version 3.0.0)
|      |                     |            | warnings.
|  -1  |         yarn tests  |  6m 8s     | Tests failed in 
|      |                     |            | hadoop-yarn-server-nodemanager.
|      |                     |  44m 10s   | 


             Reason | Tests
 Failed unit tests  |  hadoop.yarn.server.nodemanager.TestDeletionService 


|| Subsystem || Report/Notes ||
============================================================================
| Patch URL | http://issues.apache.org/jira/secure/attachment/12749233/YARN-3591.6.patch |
| Optional Tests | javadoc javac unit findbugs checkstyle |
| git revision | trunk / b6265d3 |
| checkstyle |  /home/jenkins/jenkins-slave/workspace/PreCommit-YARN-Build/patchprocess/diffcheckstylehadoop-yarn-server-nodemanager.txt
|
| whitespace | /home/jenkins/jenkins-slave/workspace/PreCommit-YARN-Build/patchprocess/whitespace.txt
|
| hadoop-yarn-server-nodemanager test log | /home/jenkins/jenkins-slave/workspace/PreCommit-YARN-Build/patchprocess/testrun_hadoop-yarn-server-nodemanager.txt
|
| Test Results | https://builds.apache.org/job/PreCommit-YARN-Build/8787/testReport/ |
| Java | 1.7.0_55 |
| uname | Linux asf904.gq1.ygridcore.net 3.13.0-36-lowlatency #63-Ubuntu SMP PREEMPT Wed Sep
3 21:56:12 UTC 2014 x86_64 x86_64 x86_64 GNU/Linux |


============================================================================
============================================================================
                          Adding comment to JIRA
============================================================================
============================================================================


Comment added.
909391d85de1454e77090ffe351c44db845ef936 logged out


============================================================================
============================================================================
                              Finished build.
============================================================================
============================================================================


Build step 'Execute shell' marked build as failure
Archiving artifacts
Sending artifact delta relative to PreCommit-YARN-Build #8782
Archived 30 artifacts
Archive block size is 32768
Received 235 blocks and 4284674 bytes
Compression is 64.3%
Took 1.3 sec
[description-setter] Could not determine description.
Recording test results
Email was triggered for: Failure
Sending email for trigger: Failure



###################################################################################
############################## FAILED TESTS (if any) ##############################
1 tests failed.
FAILED:  org.apache.hadoop.yarn.server.nodemanager.TestDeletionService.testRelativeDelete

Error Message:
/home/jenkins/jenkins-slave/workspace/PreCommit-YARN-Build/hadoop-yarn-project/hadoop-yarn/hadoop-yarn-server/hadoop-yarn-server-nodemanager/target/org.apache.hadoop.yarn.server.nodemanager.TestDeletionService/-818457045884622451/-1798701062341369786/-4074941900077892684/-1318095437033862147

Stack Trace:
java.nio.file.NoSuchFileException: /home/jenkins/jenkins-slave/workspace/PreCommit-YARN-Build/hadoop-yarn-project/hadoop-yarn/hadoop-yarn-server/hadoop-yarn-server-nodemanager/target/org.apache.hadoop.yarn.server.nodemanager.TestDeletionService/-818457045884622451/-1798701062341369786/-4074941900077892684/-1318095437033862147
	at sun.nio.fs.UnixException.translateToIOException(UnixException.java:86)
	at sun.nio.fs.UnixException.rethrowAsIOException(UnixException.java:102)
	at sun.nio.fs.UnixException.rethrowAsIOException(UnixException.java:107)
	at sun.nio.fs.UnixFileAttributeViews$Basic.readAttributes(UnixFileAttributeViews.java:55)
	at sun.nio.fs.UnixFileSystemProvider.readAttributes(UnixFileSystemProvider.java:144)
	at sun.nio.fs.LinuxFileSystemProvider.readAttributes(LinuxFileSystemProvider.java:97)
	at java.nio.file.Files.readAttributes(Files.java:1684)
	at org.apache.hadoop.fs.RawLocalFileSystem$DeprecatedRawLocalFileStatus.<init>(RawLocalFileSystem.java:656)
	at org.apache.hadoop.fs.RawLocalFileSystem.deprecatedGetFileStatus(RawLocalFileSystem.java:637)
	at org.apache.hadoop.fs.RawLocalFileSystem.getFileLinkStatusInternal(RawLocalFileSystem.java:853)
	at org.apache.hadoop.fs.RawLocalFileSystem.getFileStatus(RawLocalFileSystem.java:630)
	at org.apache.hadoop.fs.DelegateToFileSystem.getFileStatus(DelegateToFileSystem.java:125)
	at org.apache.hadoop.fs.FilterFs.getFileStatus(FilterFs.java:121)
	at org.apache.hadoop.fs.FileContext$15.next(FileContext.java:1164)
	at org.apache.hadoop.fs.FileContext$15.next(FileContext.java:1160)
	at org.apache.hadoop.fs.FSLinkResolver.resolve(FSLinkResolver.java:90)
	at org.apache.hadoop.fs.FileContext.getFileStatus(FileContext.java:1160)
	at org.apache.hadoop.fs.FileContext$Util.exists(FileContext.java:1625)
	at org.apache.hadoop.yarn.server.nodemanager.TestDeletionService.testRelativeDelete(TestDeletionService.java:170)



Mime
  • Unnamed multipart/mixed (inline, None, 0 bytes)
View raw message