hadoop-yarn-dev mailing list archives

Site index · List index
Message view « Date » · « Thread »
Top « Date » · « Thread »
From Apache Jenkins Server <jenk...@builds.apache.org>
Subject Failed: YARN-4093 PreCommit Build #8940
Date Sat, 29 Aug 2015 04:09:29 GMT
Jira: https://issues.apache.org/jira/browse/YARN-4093
Build: https://builds.apache.org/job/PreCommit-YARN-Build/8940/

###################################################################################
########################## LAST 60 LINES OF THE CONSOLE ###########################
[...truncated 384 lines...]
|  +1  |         yarn tests  |  6m 52s    | Tests passed in hadoop-yarn-client. 
|  -1  |         yarn tests  |  1m 56s    | Tests failed in hadoop-yarn-common. 
|  -1  |         yarn tests  |  52m 47s   | Tests failed in 
|      |                     |            | hadoop-yarn-server-resourcemanager.
|      |                     |  110m 39s  | 


             Reason | Tests
          FindBugs  |  module:hadoop-yarn-common 
 Failed unit tests  |  hadoop.yarn.api.TestPBImplRecords 
      Failed build  |  hadoop-yarn-server-resourcemanager 


|| Subsystem || Report/Notes ||
============================================================================
| Patch URL | http://issues.apache.org/jira/secure/attachment/12753110/YARN-4093.v2.patch
|
| Optional Tests | javadoc javac unit findbugs checkstyle |
| git revision | trunk / e2c9b28 |
| checkstyle |  /home/jenkins/jenkins-slave/workspace/PreCommit-YARN-Build/patchprocess/diffcheckstylehadoop-yarn-api.txt
|
| Findbugs warnings | /home/jenkins/jenkins-slave/workspace/PreCommit-YARN-Build/patchprocess/newPatchFindbugsWarningshadoop-yarn-common.html
|
| hadoop-yarn-api test log | /home/jenkins/jenkins-slave/workspace/PreCommit-YARN-Build/patchprocess/testrun_hadoop-yarn-api.txt
|
| hadoop-yarn-client test log | /home/jenkins/jenkins-slave/workspace/PreCommit-YARN-Build/patchprocess/testrun_hadoop-yarn-client.txt
|
| hadoop-yarn-common test log | /home/jenkins/jenkins-slave/workspace/PreCommit-YARN-Build/patchprocess/testrun_hadoop-yarn-common.txt
|
| hadoop-yarn-server-resourcemanager test log | /home/jenkins/jenkins-slave/workspace/PreCommit-YARN-Build/patchprocess/testrun_hadoop-yarn-server-resourcemanager.txt
|
| Test Results | https://builds.apache.org/job/PreCommit-YARN-Build/8940/testReport/ |
| Java | 1.7.0_55 |
| uname | Linux asf905.gq1.ygridcore.net 3.13.0-36-lowlatency #63-Ubuntu SMP PREEMPT Wed Sep
3 21:56:12 UTC 2014 x86_64 x86_64 x86_64 GNU/Linux |


============================================================================
============================================================================
                          Adding comment to JIRA
============================================================================
============================================================================


Comment added.
e1843f3ea2ab202577022a6a46f4823a12d23f21 logged out


============================================================================
============================================================================
                              Finished build.
============================================================================
============================================================================


Build step 'Execute shell' marked build as failure
Archiving artifacts
Sending artifact delta relative to PreCommit-YARN-Build #8939
Archived 72 artifacts
Archive block size is 32768
Received 80 blocks and 29832106 bytes
Compression is 8.1%
Took 5.7 sec
[description-setter] Could not determine description.
Recording test results
Email was triggered for: Failure
Sending email for trigger: Failure



###################################################################################
############################## FAILED TESTS (if any) ##############################
1 tests failed.
FAILED:  org.apache.hadoop.yarn.api.TestPBImplRecords.testAllocateRequestPBImpl

Error Message:
type class org.apache.hadoop.yarn.api.records.GroupProfile is not supported

Stack Trace:
java.lang.IllegalArgumentException: type class org.apache.hadoop.yarn.api.records.GroupProfile
is not supported
	at org.apache.hadoop.yarn.api.TestPBImplRecords.genTypeValue(TestPBImplRecords.java:396)
	at org.apache.hadoop.yarn.api.TestPBImplRecords.genTypeValue(TestPBImplRecords.java:386)
	at org.apache.hadoop.yarn.api.TestPBImplRecords.getGetSetPairs(TestPBImplRecords.java:573)
	at org.apache.hadoop.yarn.api.TestPBImplRecords.validatePBImplRecord(TestPBImplRecords.java:588)
	at org.apache.hadoop.yarn.api.TestPBImplRecords.testAllocateRequestPBImpl(TestPBImplRecords.java:611)



Mime
  • Unnamed multipart/mixed (inline, None, 0 bytes)
View raw message