hadoop-yarn-dev mailing list archives

Site index · List index
Message view « Date » · « Thread »
Top « Date » · « Thread »
From Apache Jenkins Server <jenk...@builds.apache.org>
Subject Failed: YARN-3528 PreCommit Build #8917
Date Wed, 26 Aug 2015 12:01:51 GMT
Jira: https://issues.apache.org/jira/browse/YARN-3528
Build: https://builds.apache.org/job/PreCommit-YARN-Build/8917/

###################################################################################
########################## LAST 60 LINES OF THE CONSOLE ###########################
[...truncated 321 lines...]
|  +1  |    eclipse:eclipse  |  0m 33s    | The patch built with 
|      |                     |            | eclipse:eclipse.
|  +1  |           findbugs  |  3m 3s     | The patch does not introduce any 
|      |                     |            | new Findbugs (version 3.0.0)
|      |                     |            | warnings.
|  +1  |       common tests  |  22m 48s   | Tests passed in hadoop-common. 
|  -1  |         yarn tests  |  7m 27s    | Tests failed in 
|      |                     |            | hadoop-yarn-server-nodemanager.
|      |                     |  53m 46s   | 


             Reason | Tests
 Failed unit tests  |  hadoop.yarn.server.nodemanager.containermanager.localizer.TestResourceLocalizationService



|| Subsystem || Report/Notes ||
============================================================================
| Patch URL | http://issues.apache.org/jira/secure/attachment/12752441/YARN-3528-006.patch
|
| Optional Tests | javac unit findbugs checkstyle |
| git revision | trunk / a4d9acc |
| whitespace | /home/jenkins/jenkins-slave/workspace/PreCommit-YARN-Build@2/patchprocess/whitespace.txt
|
| hadoop-common test log | /home/jenkins/jenkins-slave/workspace/PreCommit-YARN-Build@2/patchprocess/testrun_hadoop-common.txt
|
| hadoop-yarn-server-nodemanager test log | /home/jenkins/jenkins-slave/workspace/PreCommit-YARN-Build@2/patchprocess/testrun_hadoop-yarn-server-nodemanager.txt
|
| Test Results | https://builds.apache.org/job/PreCommit-YARN-Build/8917/testReport/ |
| Java | 1.7.0_55 |
| uname | Linux asf908.gq1.ygridcore.net 3.13.0-36-lowlatency #63-Ubuntu SMP PREEMPT Wed Sep
3 21:56:12 UTC 2014 x86_64 x86_64 x86_64 GNU/Linux |


============================================================================
============================================================================
                          Adding comment to JIRA
============================================================================
============================================================================


Comment added.
1545007c265fa3f326ac8bfb8978e3e0eae26931 logged out


============================================================================
============================================================================
                              Finished build.
============================================================================
============================================================================


Build step 'Execute shell' marked build as failure
Archiving artifacts
Sending artifact delta relative to PreCommit-YARN-Build #8899
Archived 41 artifacts
Archive block size is 32768
Received 9 blocks and 17520713 bytes
Compression is 1.7%
Took 3.6 sec
[description-setter] Could not determine description.
Recording test results
Publish JUnit test result report is waiting for a checkpoint on PreCommit-YARN-Build #8916
Email was triggered for: Failure
Sending email for trigger: Failure



###################################################################################
############################## FAILED TESTS (if any) ##############################
1 tests failed.
FAILED:  org.apache.hadoop.yarn.server.nodemanager.containermanager.localizer.TestResourceLocalizationService.testPublicResourceInitializesLocalDir

Error Message:
target/org.apache.hadoop.yarn.server.nodemanager.containermanager.localizer.TestResourceLocalizationService/3/filecache/10
does not exist

Stack Trace:
java.lang.IllegalArgumentException: target/org.apache.hadoop.yarn.server.nodemanager.containermanager.localizer.TestResourceLocalizationService/3/filecache/10
does not exist
	at org.apache.commons.io.FileUtils.cleanDirectory(FileUtils.java:1637)
	at org.apache.commons.io.FileUtils.deleteDirectory(FileUtils.java:1535)
	at org.apache.commons.io.FileUtils.forceDelete(FileUtils.java:2270)
	at org.apache.commons.io.FileUtils.cleanDirectory(FileUtils.java:1653)
	at org.apache.commons.io.FileUtils.deleteDirectory(FileUtils.java:1535)
	at org.apache.commons.io.FileUtils.forceDelete(FileUtils.java:2270)
	at org.apache.commons.io.FileUtils.cleanDirectory(FileUtils.java:1653)
	at org.apache.commons.io.FileUtils.deleteDirectory(FileUtils.java:1535)
	at org.apache.commons.io.FileUtils.forceDelete(FileUtils.java:2270)
	at org.apache.commons.io.FileUtils.cleanDirectory(FileUtils.java:1653)
	at org.apache.commons.io.FileUtils.deleteDirectory(FileUtils.java:1535)
	at org.apache.hadoop.yarn.server.nodemanager.containermanager.localizer.TestResourceLocalizationService.cleanup(TestResourceLocalizationService.java:189)



Mime
  • Unnamed multipart/mixed (inline, None, 0 bytes)
View raw message