hadoop-yarn-dev mailing list archives

Site index · List index
Message view « Date » · « Thread »
Top « Date » · « Thread »
From Apache Jenkins Server <jenk...@builds.apache.org>
Subject Failed: YARN-3949 PreCommit Build #8661
Date Sat, 25 Jul 2015 00:31:45 GMT
Jira: https://issues.apache.org/jira/browse/YARN-3949
Build: https://builds.apache.org/job/PreCommit-YARN-Build/8661/

###################################################################################
########################## LAST 60 LINES OF THE CONSOLE ###########################
[...truncated 359 lines...]
|  +1  |           findbugs  |  3m 52s    | The patch does not introduce any 
|      |                     |            | new Findbugs (version 3.0.0)
|      |                     |            | warnings.
|  +1  |         yarn tests  |  0m 22s    | Tests passed in hadoop-yarn-api. 
|  -1  |         yarn tests  |  1m 54s    | Tests failed in hadoop-yarn-common. 
|  +1  |         yarn tests  |  1m 24s    | Tests passed in 
|      |                     |            | hadoop-yarn-server-timelineservice.
|      |                     |  49m 18s   | 


             Reason | Tests
 Failed unit tests  |  hadoop.yarn.conf.TestYarnConfigurationFields 


|| Subsystem || Report/Notes ||
============================================================================
| Patch URL | http://issues.apache.org/jira/secure/attachment/12747125/YARN-3949-YARN-2928.003.patch
|
| Optional Tests | javadoc javac unit findbugs checkstyle |
| git revision | YARN-2928 / eb1932d |
| checkstyle |  /home/jenkins/jenkins-slave/workspace/PreCommit-YARN-Build/patchprocess/diffcheckstylehadoop-yarn-api.txt
|
| hadoop-yarn-api test log | /home/jenkins/jenkins-slave/workspace/PreCommit-YARN-Build/patchprocess/testrun_hadoop-yarn-api.txt
|
| hadoop-yarn-common test log | /home/jenkins/jenkins-slave/workspace/PreCommit-YARN-Build/patchprocess/testrun_hadoop-yarn-common.txt
|
| hadoop-yarn-server-timelineservice test log | /home/jenkins/jenkins-slave/workspace/PreCommit-YARN-Build/patchprocess/testrun_hadoop-yarn-server-timelineservice.txt
|
| Test Results | https://builds.apache.org/job/PreCommit-YARN-Build/8661/testReport/ |
| Java | 1.7.0_55 |
| uname | Linux asf903.gq1.ygridcore.net 3.13.0-36-lowlatency #63-Ubuntu SMP PREEMPT Wed Sep
3 21:56:12 UTC 2014 x86_64 x86_64 x86_64 GNU/Linux |


============================================================================
============================================================================
                          Adding comment to JIRA
============================================================================
============================================================================


Comment added.
0cd5b0b0d14f4b371936209a7e8ac9516d896476 logged out


============================================================================
============================================================================
                              Finished build.
============================================================================
============================================================================


Build step 'Execute shell' marked build as failure
Archiving artifacts
Sending artifact delta relative to PreCommit-YARN-Build #8652
Archived 54 artifacts
Archive block size is 32768
Received 372 blocks and 16708759 bytes
Compression is 42.2%
Took 3.8 sec
[description-setter] Could not determine description.
Recording test results
Publish JUnit test result report is waiting for a checkpoint on PreCommit-YARN-Build #8660
Email was triggered for: Failure
Sending email for trigger: Failure



###################################################################################
############################## FAILED TESTS (if any) ##############################
1 tests failed.
FAILED:  org.apache.hadoop.yarn.conf.TestYarnConfigurationFields.testCompareConfigurationClassAgainstXml

Error Message:
class org.apache.hadoop.yarn.conf.YarnConfiguration has 1 variables missing in yarn-default.xml

Stack Trace:
java.lang.AssertionError: class org.apache.hadoop.yarn.conf.YarnConfiguration has 1 variables
missing in yarn-default.xml
	at org.junit.Assert.fail(Assert.java:88)
	at org.junit.Assert.assertTrue(Assert.java:41)
	at org.apache.hadoop.conf.TestConfigurationFieldsBase.testCompareConfigurationClassAgainstXml(TestConfigurationFieldsBase.java:429)
	at sun.reflect.NativeMethodAccessorImpl.invoke0(Native Method)
	at sun.reflect.NativeMethodAccessorImpl.invoke(NativeMethodAccessorImpl.java:57)
	at sun.reflect.DelegatingMethodAccessorImpl.invoke(DelegatingMethodAccessorImpl.java:43)
	at java.lang.reflect.Method.invoke(Method.java:606)
	at org.junit.runners.model.FrameworkMethod$1.runReflectiveCall(FrameworkMethod.java:47)
	at org.junit.internal.runners.model.ReflectiveCallable.run(ReflectiveCallable.java:12)
	at org.junit.runners.model.FrameworkMethod.invokeExplosively(FrameworkMethod.java:44)
	at org.junit.internal.runners.statements.InvokeMethod.evaluate(InvokeMethod.java:17)
	at org.junit.internal.runners.statements.RunBefores.evaluate(RunBefores.java:26)
	at org.junit.runners.ParentRunner.runLeaf(ParentRunner.java:271)
	at org.junit.runners.BlockJUnit4ClassRunner.runChild(BlockJUnit4ClassRunner.java:70)
	at org.junit.runners.BlockJUnit4ClassRunner.runChild(BlockJUnit4ClassRunner.java:50)
	at org.junit.runners.ParentRunner$3.run(ParentRunner.java:238)
	at org.junit.runners.ParentRunner$1.schedule(ParentRunner.java:63)
	at org.junit.runners.ParentRunner.runChildren(ParentRunner.java:236)
	at org.junit.runners.ParentRunner.access$000(ParentRunner.java:53)
	at org.junit.runners.ParentRunner$2.evaluate(ParentRunner.java:229)
	at org.junit.runners.ParentRunner.run(ParentRunner.java:309)
	at org.apache.maven.surefire.junit4.JUnit4Provider.execute(JUnit4Provider.java:264)
	at org.apache.maven.surefire.junit4.JUnit4Provider.executeTestSet(JUnit4Provider.java:153)
	at org.apache.maven.surefire.junit4.JUnit4Provider.invoke(JUnit4Provider.java:124)
	at org.apache.maven.surefire.booter.ForkedBooter.invokeProviderInSameClassLoader(ForkedBooter.java:200)
	at org.apache.maven.surefire.booter.ForkedBooter.runSuitesInProcess(ForkedBooter.java:153)
	at org.apache.maven.surefire.booter.ForkedBooter.main(ForkedBooter.java:103)



Mime
  • Unnamed multipart/mixed (inline, None, 0 bytes)
View raw message