hadoop-yarn-dev mailing list archives

Site index · List index
Message view « Date » · « Thread »
Top « Date » · « Thread »
From Apache Jenkins Server <jenk...@builds.apache.org>
Subject Failed: YARN-2681 PreCommit Build #8411
Date Wed, 01 Jul 2015 22:00:46 GMT
Jira: https://issues.apache.org/jira/browse/YARN-2681
Build: https://builds.apache.org/job/PreCommit-YARN-Build/8411/

###################################################################################
########################## LAST 60 LINES OF THE CONSOLE ###########################
[...truncated 669 lines...]
                    |  hadoop.yarn.server.nodemanager.containermanager.logaggregation.TestLogAggregationService 
                    |  hadoop.yarn.server.nodemanager.containermanager.monitor.TestContainersMonitor 
                    |  hadoop.yarn.server.nodemanager.containermanager.launcher.TestContainerLaunch 
                    |  hadoop.yarn.server.nodemanager.containermanager.TestNMProxy 
                    |  hadoop.yarn.server.resourcemanager.TestAppManager 
                    |  hadoop.yarn.server.resourcemanager.webapp.TestRMWebServicesCapacitySched 
   Timed out tests  |  org.apache.hadoop.yarn.server.resourcemanager.TestRMRestart 
                    |  org.apache.hadoop.yarn.server.resourcemanager.scheduler.capacity.TestNodeLabelContainerAllocation 
                    |  org.apache.hadoop.yarn.server.resourcemanager.scheduler.capacity.TestCapacityScheduler 


|| Subsystem || Report/Notes ||
============================================================================
| Patch URL | http://issues.apache.org/jira/secure/attachment/12743129/YARN-2681.patch |
| Optional Tests | javadoc javac unit findbugs checkstyle |
| git revision | trunk / eac1d18 |
| Pre-patch Findbugs warnings | /home/jenkins/jenkins-slave/workspace/PreCommit-YARN-Build/patchprocess/trunkFindbugsWarningshadoop-mapreduce-client-app.html |
| checkstyle |  /home/jenkins/jenkins-slave/workspace/PreCommit-YARN-Build/patchprocess/diffcheckstylehadoop-yarn-api.txt |
| hadoop-mapreduce-client-app test log | /home/jenkins/jenkins-slave/workspace/PreCommit-YARN-Build/patchprocess/testrun_hadoop-mapreduce-client-app.txt |
| hadoop-mapreduce-client-core test log | /home/jenkins/jenkins-slave/workspace/PreCommit-YARN-Build/patchprocess/testrun_hadoop-mapreduce-client-core.txt |
| hadoop-yarn-api test log | /home/jenkins/jenkins-slave/workspace/PreCommit-YARN-Build/patchprocess/testrun_hadoop-yarn-api.txt |
| hadoop-yarn-common test log | /home/jenkins/jenkins-slave/workspace/PreCommit-YARN-Build/patchprocess/testrun_hadoop-yarn-common.txt |
| hadoop-yarn-server-nodemanager test log | /home/jenkins/jenkins-slave/workspace/PreCommit-YARN-Build/patchprocess/testrun_hadoop-yarn-server-nodemanager.txt |
| hadoop-yarn-server-resourcemanager test log | /home/jenkins/jenkins-slave/workspace/PreCommit-YARN-Build/patchprocess/testrun_hadoop-yarn-server-resourcemanager.txt |
| Test Results | https://builds.apache.org/job/PreCommit-YARN-Build/8411/testReport/ |
| Java | 1.7.0_55 |
| uname | Linux asf904.gq1.ygridcore.net 3.13.0-36-lowlatency #63-Ubuntu SMP PREEMPT Wed Sep 3 21:56:12 UTC 2014 x86_64 x86_64 x86_64 GNU/Linux |


============================================================================
============================================================================
                          Adding comment to JIRA
============================================================================
============================================================================


Comment added.
712c2f1a99590c21e993d3a3ef323e1407d8e79d logged out


============================================================================
============================================================================
                              Finished build.
============================================================================
============================================================================


Build step 'Execute shell' marked build as failure
Archiving artifacts
Sending artifact delta relative to PreCommit-YARN-Build #8403
Archived 100 artifacts
Archive block size is 32768
Received 60 blocks and 37967254 bytes
Compression is 4.9%
Took 11 sec
Description set: MAPREDUCE-6418
Recording test results
Email was triggered for: Failure
Sending email for trigger: Failure



###################################################################################
############################## FAILED TESTS (if any) ##############################
70 tests failed.
FAILED:  org.apache.hadoop.yarn.server.nodemanager.TestEventFlow.testSuccessfulContainerLaunch

Error Message:
java.lang.NullPointerException

Stack Trace:
org.apache.hadoop.yarn.exceptions.YarnRuntimeException: java.lang.NullPointerException
	at org.apache.hadoop.yarn.server.nodemanager.NodeStatusUpdaterImpl.serviceStart(NodeStatusUpdaterImpl.java:236)
	at org.apache.hadoop.service.AbstractService.start(AbstractService.java:193)
	at org.apache.hadoop.yarn.server.nodemanager.TestEventFlow.testSuccessfulContainerLaunch(TestEventFlow.java:134)


FAILED:  org.apache.hadoop.yarn.server.nodemanager.containermanager.TestContainerManager.testContainerLaunchAndExitFailure

Error Message:
java.lang.NullPointerException

Stack Trace:
org.apache.hadoop.yarn.exceptions.YarnRuntimeException: java.lang.NullPointerException
	at org.apache.hadoop.yarn.server.nodemanager.NodeStatusUpdaterImpl.serviceStart(NodeStatusUpdaterImpl.java:236)
	at org.apache.hadoop.service.AbstractService.start(AbstractService.java:193)
	at org.apache.hadoop.yarn.server.nodemanager.containermanager.BaseContainerManagerTest.setup(BaseContainerManagerTest.java:188)
	at org.apache.hadoop.yarn.server.nodemanager.containermanager.TestContainerManager.setup(TestContainerManager.java:104)


FAILED:  org.apache.hadoop.yarn.server.nodemanager.containermanager.TestContainerManager.testContainerSetup

Error Message:
java.lang.NullPointerException

Stack Trace:
org.apache.hadoop.yarn.exceptions.YarnRuntimeException: java.lang.NullPointerException
	at org.apache.hadoop.yarn.server.nodemanager.NodeStatusUpdaterImpl.serviceStart(NodeStatusUpdaterImpl.java:236)
	at org.apache.hadoop.service.AbstractService.start(AbstractService.java:193)
	at org.apache.hadoop.yarn.server.nodemanager.containermanager.BaseContainerManagerTest.setup(BaseContainerManagerTest.java:188)
	at org.apache.hadoop.yarn.server.nodemanager.containermanager.TestContainerManager.setup(TestContainerManager.java:104)


FAILED:  org.apache.hadoop.yarn.server.nodemanager.containermanager.TestContainerManager.testContainerManagerInitialization

Error Message:
java.lang.NullPointerException

Stack Trace:
org.apache.hadoop.yarn.exceptions.YarnRuntimeException: java.lang.NullPointerException
	at org.apache.hadoop.yarn.server.nodemanager.NodeStatusUpdaterImpl.serviceStart(NodeStatusUpdaterImpl.java:236)
	at org.apache.hadoop.service.AbstractService.start(AbstractService.java:193)
	at org.apache.hadoop.yarn.server.nodemanager.containermanager.BaseContainerManagerTest.setup(BaseContainerManagerTest.java:188)
	at org.apache.hadoop.yarn.server.nodemanager.containermanager.TestContainerManager.setup(TestContainerManager.java:104)


FAILED:  org.apache.hadoop.yarn.server.nodemanager.containermanager.TestContainerManager.testStartContainerFailureWithUnknownAuxService

Error Message:
java.lang.NullPointerException

Stack Trace:
org.apache.hadoop.yarn.exceptions.YarnRuntimeException: java.lang.NullPointerException
	at org.apache.hadoop.yarn.server.nodemanager.NodeStatusUpdaterImpl.serviceStart(NodeStatusUpdaterImpl.java:236)
	at org.apache.hadoop.service.AbstractService.start(AbstractService.java:193)
	at org.apache.hadoop.yarn.server.nodemanager.containermanager.BaseContainerManagerTest.setup(BaseContainerManagerTest.java:188)
	at org.apache.hadoop.yarn.server.nodemanager.containermanager.TestContainerManager.setup(TestContainerManager.java:104)


FAILED:  org.apache.hadoop.yarn.server.nodemanager.containermanager.TestContainerManager.testContainerLaunchAndStop

Error Message:
java.lang.NullPointerException

Stack Trace:
org.apache.hadoop.yarn.exceptions.YarnRuntimeException: java.lang.NullPointerException
	at org.apache.hadoop.yarn.server.nodemanager.NodeStatusUpdaterImpl.serviceStart(NodeStatusUpdaterImpl.java:236)
	at org.apache.hadoop.service.AbstractService.start(AbstractService.java:193)
	at org.apache.hadoop.yarn.server.nodemanager.containermanager.BaseContainerManagerTest.setup(BaseContainerManagerTest.java:188)
	at org.apache.hadoop.yarn.server.nodemanager.containermanager.TestContainerManager.setup(TestContainerManager.java:104)


FAILED:  org.apache.hadoop.yarn.server.nodemanager.containermanager.TestContainerManager.testLocalFilesCleanup

Error Message:
java.lang.NullPointerException

Stack Trace:
org.apache.hadoop.yarn.exceptions.YarnRuntimeException: java.lang.NullPointerException
	at org.apache.hadoop.yarn.server.nodemanager.NodeStatusUpdaterImpl.serviceStart(NodeStatusUpdaterImpl.java:236)
	at org.apache.hadoop.service.AbstractService.start(AbstractService.java:193)
	at org.apache.hadoop.yarn.server.nodemanager.containermanager.BaseContainerManagerTest.setup(BaseContainerManagerTest.java:188)
	at org.apache.hadoop.yarn.server.nodemanager.containermanager.TestContainerManager.setup(TestContainerManager.java:104)


FAILED:  org.apache.hadoop.yarn.server.nodemanager.containermanager.TestContainerManager.testContainerLaunchFromPreviousRM

Error Message:
java.lang.NullPointerException

Stack Trace:
org.apache.hadoop.yarn.exceptions.YarnRuntimeException: java.lang.NullPointerException
	at org.apache.hadoop.yarn.server.nodemanager.NodeStatusUpdaterImpl.serviceStart(NodeStatusUpdaterImpl.java:236)
	at org.apache.hadoop.service.AbstractService.start(AbstractService.java:193)
	at org.apache.hadoop.yarn.server.nodemanager.containermanager.BaseContainerManagerTest.setup(BaseContainerManagerTest.java:188)
	at org.apache.hadoop.yarn.server.nodemanager.containermanager.TestContainerManager.setup(TestContainerManager.java:104)


FAILED:  org.apache.hadoop.yarn.server.nodemanager.containermanager.TestContainerManager.testNullTokens

Error Message:
java.lang.NullPointerException

Stack Trace:
org.apache.hadoop.yarn.exceptions.YarnRuntimeException: java.lang.NullPointerException
	at org.apache.hadoop.yarn.server.nodemanager.NodeStatusUpdaterImpl.serviceStart(NodeStatusUpdaterImpl.java:236)
	at org.apache.hadoop.service.AbstractService.start(AbstractService.java:193)
	at org.apache.hadoop.yarn.server.nodemanager.containermanager.BaseContainerManagerTest.setup(BaseContainerManagerTest.java:188)
	at org.apache.hadoop.yarn.server.nodemanager.containermanager.TestContainerManager.setup(TestContainerManager.java:104)


FAILED:  org.apache.hadoop.yarn.server.nodemanager.containermanager.TestContainerManager.testContainerLaunchAndExitSuccess

Error Message:
java.lang.NullPointerException

Stack Trace:
org.apache.hadoop.yarn.exceptions.YarnRuntimeException: java.lang.NullPointerException
	at org.apache.hadoop.yarn.server.nodemanager.NodeStatusUpdaterImpl.serviceStart(NodeStatusUpdaterImpl.java:236)
	at org.apache.hadoop.service.AbstractService.start(AbstractService.java:193)
	at org.apache.hadoop.yarn.server.nodemanager.containermanager.BaseContainerManagerTest.setup(BaseContainerManagerTest.java:188)
	at org.apache.hadoop.yarn.server.nodemanager.containermanager.TestContainerManager.setup(TestContainerManager.java:104)


FAILED:  org.apache.hadoop.yarn.server.nodemanager.containermanager.TestContainerManager.testMultipleContainersLaunch

Error Message:
java.lang.NullPointerException

Stack Trace:
org.apache.hadoop.yarn.exceptions.YarnRuntimeException: java.lang.NullPointerException
	at org.apache.hadoop.yarn.server.nodemanager.NodeStatusUpdaterImpl.serviceStart(NodeStatusUpdaterImpl.java:236)
	at org.apache.hadoop.service.AbstractService.start(AbstractService.java:193)
	at org.apache.hadoop.yarn.server.nodemanager.containermanager.BaseContainerManagerTest.setup(BaseContainerManagerTest.java:188)
	at org.apache.hadoop.yarn.server.nodemanager.containermanager.TestContainerManager.setup(TestContainerManager.java:104)


FAILED:  org.apache.hadoop.yarn.server.nodemanager.containermanager.TestContainerManager.testMultipleContainersStopAndGetStatus

Error Message:
java.lang.NullPointerException

Stack Trace:
org.apache.hadoop.yarn.exceptions.YarnRuntimeException: java.lang.NullPointerException
	at org.apache.hadoop.yarn.server.nodemanager.NodeStatusUpdaterImpl.serviceStart(NodeStatusUpdaterImpl.java:236)
	at org.apache.hadoop.service.AbstractService.start(AbstractService.java:193)
	at org.apache.hadoop.yarn.server.nodemanager.containermanager.BaseContainerManagerTest.setup(BaseContainerManagerTest.java:188)
	at org.apache.hadoop.yarn.server.nodemanager.containermanager.TestContainerManager.setup(TestContainerManager.java:104)


FAILED:  org.apache.hadoop.yarn.server.nodemanager.containermanager.TestNMProxy.testShouldNotRetryForeverForNonNetworkExceptionsOnNMConnections

Error Message:
java.lang.NullPointerException

Stack Trace:
org.apache.hadoop.yarn.exceptions.YarnRuntimeException: java.lang.NullPointerException
	at org.apache.hadoop.yarn.server.nodemanager.NodeStatusUpdaterImpl.serviceStart(NodeStatusUpdaterImpl.java:241)
	at org.apache.hadoop.service.AbstractService.start(AbstractService.java:193)
	at org.apache.hadoop.yarn.server.nodemanager.containermanager.BaseContainerManagerTest.setup(BaseContainerManagerTest.java:188)
	at sun.reflect.NativeMethodAccessorImpl.invoke0(Native Method)
	at sun.reflect.NativeMethodAccessorImpl.invoke(NativeMethodAccessorImpl.java:57)
	at sun.reflect.DelegatingMethodAccessorImpl.invoke(DelegatingMethodAccessorImpl.java:43)
	at java.lang.reflect.Method.invoke(Method.java:606)
	at org.junit.runners.model.FrameworkMethod$1.runReflectiveCall(FrameworkMethod.java:47)
	at org.junit.internal.runners.model.ReflectiveCallable.run(ReflectiveCallable.java:12)
	at org.junit.runners.model.FrameworkMethod.invokeExplosively(FrameworkMethod.java:44)
	at org.junit.internal.runners.statements.RunBefores.evaluate(RunBefores.java:24)
	at org.junit.internal.runners.statements.RunAfters.evaluate(RunAfters.java:27)
	at org.junit.runners.ParentRunner.runLeaf(ParentRunner.java:271)
	at org.junit.runners.BlockJUnit4ClassRunner.runChild(BlockJUnit4ClassRunner.java:70)
	at org.junit.runners.BlockJUnit4ClassRunner.runChild(BlockJUnit4ClassRunner.java:50)
	at org.junit.runners.ParentRunner$3.run(ParentRunner.java:238)
	at org.junit.runners.ParentRunner$1.schedule(ParentRunner.java:63)
	at org.junit.runners.ParentRunner.runChildren(ParentRunner.java:236)
	at org.junit.runners.ParentRunner.access$000(ParentRunner.java:53)
	at org.junit.runners.ParentRunner$2.evaluate(ParentRunner.java:229)
	at org.junit.runners.ParentRunner.run(ParentRunner.java:309)
	at org.apache.maven.surefire.junit4.JUnit4Provider.execute(JUnit4Provider.java:264)
	at org.apache.maven.surefire.junit4.JUnit4Provider.executeTestSet(JUnit4Provider.java:153)
	at org.apache.maven.surefire.junit4.JUnit4Provider.invoke(JUnit4Provider.java:124)
	at org.apache.maven.surefire.booter.ForkedBooter.invokeProviderInSameClassLoader(ForkedBooter.java:200)
	at org.apache.maven.surefire.booter.ForkedBooter.runSuitesInProcess(ForkedBooter.java:153)
	at org.apache.maven.surefire.booter.ForkedBooter.main(ForkedBooter.java:103)
Caused by: java.lang.NullPointerException: null
	at org.apache.hadoop.yarn.server.nodemanager.NodeStatusUpdaterImpl.serviceStart(NodeStatusUpdaterImpl.java:236)
	at org.apache.hadoop.service.AbstractService.start(AbstractService.java:193)
	at org.apache.hadoop.yarn.server.nodemanager.containermanager.BaseContainerManagerTest.setup(BaseContainerManagerTest.java:188)
	at sun.reflect.NativeMethodAccessorImpl.invoke0(Native Method)
	at sun.reflect.NativeMethodAccessorImpl.invoke(NativeMethodAccessorImpl.java:57)
	at sun.reflect.DelegatingMethodAccessorImpl.invoke(DelegatingMethodAccessorImpl.java:43)
	at java.lang.reflect.Method.invoke(Method.java:606)
	at org.junit.runners.model.FrameworkMethod$1.runReflectiveCall(FrameworkMethod.java:47)
	at org.junit.internal.runners.model.ReflectiveCallable.run(ReflectiveCallable.java:12)
	at org.junit.runners.model.FrameworkMethod.invokeExplosively(FrameworkMethod.java:44)
	at org.junit.internal.runners.statements.RunBefores.evaluate(RunBefores.java:24)
	at org.junit.internal.runners.statements.RunAfters.evaluate(RunAfters.java:27)
	at org.junit.runners.ParentRunner.runLeaf(ParentRunner.java:271)
	at org.junit.runners.BlockJUnit4ClassRunner.runChild(BlockJUnit4ClassRunner.java:70)
	at org.junit.runners.BlockJUnit4ClassRunner.runChild(BlockJUnit4ClassRunner.java:50)
	at org.junit.runners.ParentRunner$3.run(ParentRunner.java:238)
	at org.junit.runners.ParentRunner$1.schedule(ParentRunner.java:63)
	at org.junit.runners.ParentRunner.runChildren(ParentRunner.java:236)
	at org.junit.runners.ParentRunner.access$000(ParentRunner.java:53)
	at org.junit.runners.ParentRunner$2.evaluate(ParentRunner.java:229)
	at org.junit.runners.ParentRunner.run(ParentRunner.java:309)
	at org.apache.maven.surefire.junit4.JUnit4Provider.execute(JUnit4Provider.java:264)
	at org.apache.maven.surefire.junit4.JUnit4Provider.executeTestSet(JUnit4Provider.java:153)
	at org.apache.maven.surefire.junit4.JUnit4Provider.invoke(JUnit4Provider.java:124)
	at org.apache.maven.surefire.booter.ForkedBooter.invokeProviderInSameClassLoader(ForkedBooter.java:200)
	at org.apache.maven.surefire.booter.ForkedBooter.runSuitesInProcess(ForkedBooter.java:153)
	at org.apache.maven.surefire.booter.ForkedBooter.main(ForkedBooter.java:103)


FAILED:  org.apache.hadoop.yarn.server.nodemanager.containermanager.TestNMProxy.testNMProxyRetry

Error Message:
java.lang.NullPointerException

Stack Trace:
org.apache.hadoop.yarn.exceptions.YarnRuntimeException: java.lang.NullPointerException
	at org.apache.hadoop.yarn.server.nodemanager.NodeStatusUpdaterImpl.serviceStart(NodeStatusUpdaterImpl.java:241)
	at org.apache.hadoop.service.AbstractService.start(AbstractService.java:193)
	at org.apache.hadoop.yarn.server.nodemanager.containermanager.BaseContainerManagerTest.setup(BaseContainerManagerTest.java:188)
	at sun.reflect.NativeMethodAccessorImpl.invoke0(Native Method)
	at sun.reflect.NativeMethodAccessorImpl.invoke(NativeMethodAccessorImpl.java:57)
	at sun.reflect.DelegatingMethodAccessorImpl.invoke(DelegatingMethodAccessorImpl.java:43)
	at java.lang.reflect.Method.invoke(Method.java:606)
	at org.junit.runners.model.FrameworkMethod$1.runReflectiveCall(FrameworkMethod.java:47)
	at org.junit.internal.runners.model.ReflectiveCallable.run(ReflectiveCallable.java:12)
	at org.junit.runners.model.FrameworkMethod.invokeExplosively(FrameworkMethod.java:44)
	at org.junit.internal.runners.statements.RunBefores.evaluate(RunBefores.java:24)
	at org.junit.internal.runners.statements.RunAfters.evaluate(RunAfters.java:27)
	at org.junit.runners.ParentRunner.runLeaf(ParentRunner.java:271)
	at org.junit.runners.BlockJUnit4ClassRunner.runChild(BlockJUnit4ClassRunner.java:70)
	at org.junit.runners.BlockJUnit4ClassRunner.runChild(BlockJUnit4ClassRunner.java:50)
	at org.junit.runners.ParentRunner$3.run(ParentRunner.java:238)
	at org.junit.runners.ParentRunner$1.schedule(ParentRunner.java:63)
	at org.junit.runners.ParentRunner.runChildren(ParentRunner.java:236)
	at org.junit.runners.ParentRunner.access$000(ParentRunner.java:53)
	at org.junit.runners.ParentRunner$2.evaluate(ParentRunner.java:229)
	at org.junit.runners.ParentRunner.run(ParentRunner.java:309)
	at org.apache.maven.surefire.junit4.JUnit4Provider.execute(JUnit4Provider.java:264)
	at org.apache.maven.surefire.junit4.JUnit4Provider.executeTestSet(JUnit4Provider.java:153)
	at org.apache.maven.surefire.junit4.JUnit4Provider.invoke(JUnit4Provider.java:124)
	at org.apache.maven.surefire.booter.ForkedBooter.invokeProviderInSameClassLoader(ForkedBooter.java:200)
	at org.apache.maven.surefire.booter.ForkedBooter.runSuitesInProcess(ForkedBooter.java:153)
	at org.apache.maven.surefire.booter.ForkedBooter.main(ForkedBooter.java:103)
Caused by: java.lang.NullPointerException: null
	at org.apache.hadoop.yarn.server.nodemanager.NodeStatusUpdaterImpl.serviceStart(NodeStatusUpdaterImpl.java:236)
	at org.apache.hadoop.service.AbstractService.start(AbstractService.java:193)
	at org.apache.hadoop.yarn.server.nodemanager.containermanager.BaseContainerManagerTest.setup(BaseContainerManagerTest.java:188)
	at sun.reflect.NativeMethodAccessorImpl.invoke0(Native Method)
	at sun.reflect.NativeMethodAccessorImpl.invoke(NativeMethodAccessorImpl.java:57)
	at sun.reflect.DelegatingMethodAccessorImpl.invoke(DelegatingMethodAccessorImpl.java:43)
	at java.lang.reflect.Method.invoke(Method.java:606)
	at org.junit.runners.model.FrameworkMethod$1.runReflectiveCall(FrameworkMethod.java:47)
	at org.junit.internal.runners.model.ReflectiveCallable.run(ReflectiveCallable.java:12)
	at org.junit.runners.model.FrameworkMethod.invokeExplosively(FrameworkMethod.java:44)
	at org.junit.internal.runners.statements.RunBefores.evaluate(RunBefores.java:24)
	at org.junit.internal.runners.statements.RunAfters.evaluate(RunAfters.java:27)
	at org.junit.runners.ParentRunner.runLeaf(ParentRunner.java:271)
	at org.junit.runners.BlockJUnit4ClassRunner.runChild(BlockJUnit4ClassRunner.java:70)
	at org.junit.runners.BlockJUnit4ClassRunner.runChild(BlockJUnit4ClassRunner.java:50)
	at org.junit.runners.ParentRunner$3.run(ParentRunner.java:238)
	at org.junit.runners.ParentRunner$1.schedule(ParentRunner.java:63)
	at org.junit.runners.ParentRunner.runChildren(ParentRunner.java:236)
	at org.junit.runners.ParentRunner.access$000(ParentRunner.java:53)
	at org.junit.runners.ParentRunner$2.evaluate(ParentRunner.java:229)
	at org.junit.runners.ParentRunner.run(ParentRunner.java:309)
	at org.apache.maven.surefire.junit4.JUnit4Provider.execute(JUnit4Provider.java:264)
	at org.apache.maven.surefire.junit4.JUnit4Provider.executeTestSet(JUnit4Provider.java:153)
	at org.apache.maven.surefire.junit4.JUnit4Provider.invoke(JUnit4Provider.java:124)
	at org.apache.maven.surefire.booter.ForkedBooter.invokeProviderInSameClassLoader(ForkedBooter.java:200)
	at org.apache.maven.surefire.booter.ForkedBooter.runSuitesInProcess(ForkedBooter.java:153)
	at org.apache.maven.surefire.booter.ForkedBooter.main(ForkedBooter.java:103)


FAILED:  org.apache.hadoop.yarn.server.nodemanager.containermanager.launcher.TestContainerLaunch.testAuxiliaryServiceHelper

Error Message:
java.lang.NullPointerException

Stack Trace:
org.apache.hadoop.yarn.exceptions.YarnRuntimeException: java.lang.NullPointerException
	at org.apache.hadoop.yarn.server.nodemanager.NodeStatusUpdaterImpl.serviceStart(NodeStatusUpdaterImpl.java:236)
	at org.apache.hadoop.service.AbstractService.start(AbstractService.java:193)
	at org.apache.hadoop.yarn.server.nodemanager.containermanager.BaseContainerManagerTest.setup(BaseContainerManagerTest.java:188)
	at org.apache.hadoop.yarn.server.nodemanager.containermanager.launcher.TestContainerLaunch.setup(TestContainerLaunch.java:130)


FAILED:  org.apache.hadoop.yarn.server.nodemanager.containermanager.launcher.TestContainerLaunch.testSpecialCharSymlinks

Error Message:
java.lang.NullPointerException

Stack Trace:
org.apache.hadoop.yarn.exceptions.YarnRuntimeException: java.lang.NullPointerException
	at org.apache.hadoop.yarn.server.nodemanager.NodeStatusUpdaterImpl.serviceStart(NodeStatusUpdaterImpl.java:236)
	at org.apache.hadoop.service.AbstractService.start(AbstractService.java:193)
	at org.apache.hadoop.yarn.server.nodemanager.containermanager.BaseContainerManagerTest.setup(BaseContainerManagerTest.java:188)
	at org.apache.hadoop.yarn.server.nodemanager.containermanager.launcher.TestContainerLaunch.setup(TestContainerLaunch.java:130)


FAILED:  org.apache.hadoop.yarn.server.nodemanager.containermanager.launcher.TestContainerLaunch.testImmediateKill

Error Message:
java.lang.NullPointerException

Stack Trace:
org.apache.hadoop.yarn.exceptions.YarnRuntimeException: java.lang.NullPointerException
	at org.apache.hadoop.yarn.server.nodemanager.NodeStatusUpdaterImpl.serviceStart(NodeStatusUpdaterImpl.java:236)
	at org.apache.hadoop.service.AbstractService.start(AbstractService.java:193)
	at org.apache.hadoop.yarn.server.nodemanager.containermanager.BaseContainerManagerTest.setup(BaseContainerManagerTest.java:188)
	at org.apache.hadoop.yarn.server.nodemanager.containermanager.launcher.TestContainerLaunch.setup(TestContainerLaunch.java:130)


FAILED:  org.apache.hadoop.yarn.server.nodemanager.containermanager.launcher.TestContainerLaunch.testInvalidEnvSyntaxDiagnostics

Error Message:
java.lang.NullPointerException

Stack Trace:
org.apache.hadoop.yarn.exceptions.YarnRuntimeException: java.lang.NullPointerException
	at org.apache.hadoop.yarn.server.nodemanager.NodeStatusUpdaterImpl.serviceStart(NodeStatusUpdaterImpl.java:236)
	at org.apache.hadoop.service.AbstractService.start(AbstractService.java:193)
	at org.apache.hadoop.yarn.server.nodemanager.containermanager.BaseContainerManagerTest.setup(BaseContainerManagerTest.java:188)
	at org.apache.hadoop.yarn.server.nodemanager.containermanager.launcher.TestContainerLaunch.setup(TestContainerLaunch.java:130)


FAILED:  org.apache.hadoop.yarn.server.nodemanager.containermanager.launcher.TestContainerLaunch.testWindowsShellScriptBuilderEnv

Error Message:
java.lang.NullPointerException

Stack Trace:
org.apache.hadoop.yarn.exceptions.YarnRuntimeException: java.lang.NullPointerException
	at org.apache.hadoop.yarn.server.nodemanager.NodeStatusUpdaterImpl.serviceStart(NodeStatusUpdaterImpl.java:236)
	at org.apache.hadoop.service.AbstractService.start(AbstractService.java:193)
	at org.apache.hadoop.yarn.server.nodemanager.containermanager.BaseContainerManagerTest.setup(BaseContainerManagerTest.java:188)
	at org.apache.hadoop.yarn.server.nodemanager.containermanager.launcher.TestContainerLaunch.setup(TestContainerLaunch.java:130)


FAILED:  org.apache.hadoop.yarn.server.nodemanager.containermanager.launcher.TestContainerLaunch.testWindowsShellScriptBuilderMkdir

Error Message:
java.lang.NullPointerException

Stack Trace:
org.apache.hadoop.yarn.exceptions.YarnRuntimeException: java.lang.NullPointerException
	at org.apache.hadoop.yarn.server.nodemanager.NodeStatusUpdaterImpl.serviceStart(NodeStatusUpdaterImpl.java:236)
	at org.apache.hadoop.service.AbstractService.start(AbstractService.java:193)
	at org.apache.hadoop.yarn.server.nodemanager.containermanager.BaseContainerManagerTest.setup(BaseContainerManagerTest.java:188)
	at org.apache.hadoop.yarn.server.nodemanager.containermanager.launcher.TestContainerLaunch.setup(TestContainerLaunch.java:130)


FAILED:  org.apache.hadoop.yarn.server.nodemanager.containermanager.launcher.TestContainerLaunch.testContainerEnvVariables

Error Message:
java.lang.NullPointerException

Stack Trace:
org.apache.hadoop.yarn.exceptions.YarnRuntimeException: java.lang.NullPointerException
	at org.apache.hadoop.yarn.server.nodemanager.NodeStatusUpdaterImpl.serviceStart(NodeStatusUpdaterImpl.java:236)
	at org.apache.hadoop.service.AbstractService.start(AbstractService.java:193)
	at org.apache.hadoop.yarn.server.nodemanager.containermanager.BaseContainerManagerTest.setup(BaseContainerManagerTest.java:188)
	at org.apache.hadoop.yarn.server.nodemanager.containermanager.launcher.TestContainerLaunch.setup(TestContainerLaunch.java:130)


FAILED:  org.apache.hadoop.yarn.server.nodemanager.containermanager.launcher.TestContainerLaunch.testPrependDistcache

Error Message:
java.lang.NullPointerException

Stack Trace:
org.apache.hadoop.yarn.exceptions.YarnRuntimeException: java.lang.NullPointerException
	at org.apache.hadoop.yarn.server.nodemanager.NodeStatusUpdaterImpl.serviceStart(NodeStatusUpdaterImpl.java:236)
	at org.apache.hadoop.service.AbstractService.start(AbstractService.java:193)
	at org.apache.hadoop.yarn.server.nodemanager.containermanager.BaseContainerManagerTest.setup(BaseContainerManagerTest.java:188)
	at org.apache.hadoop.yarn.server.nodemanager.containermanager.launcher.TestContainerLaunch.setup(TestContainerLaunch.java:130)


FAILED:  org.apache.hadoop.yarn.server.nodemanager.containermanager.launcher.TestContainerLaunch.testDelayedKill

Error Message:
java.lang.NullPointerException

Stack Trace:
org.apache.hadoop.yarn.exceptions.YarnRuntimeException: java.lang.NullPointerException
	at org.apache.hadoop.yarn.server.nodemanager.NodeStatusUpdaterImpl.serviceStart(NodeStatusUpdaterImpl.java:236)
	at org.apache.hadoop.service.AbstractService.start(AbstractService.java:193)
	at org.apache.hadoop.yarn.server.nodemanager.containermanager.BaseContainerManagerTest.setup(BaseContainerManagerTest.java:188)
	at org.apache.hadoop.yarn.server.nodemanager.containermanager.launcher.TestContainerLaunch.setup(TestContainerLaunch.java:130)


FAILED:  org.apache.hadoop.yarn.server.nodemanager.containermanager.launcher.TestContainerLaunch.testShellScriptBuilderNonZeroExitCode

Error Message:
java.lang.NullPointerException

Stack Trace:
org.apache.hadoop.yarn.exceptions.YarnRuntimeException: java.lang.NullPointerException
	at org.apache.hadoop.yarn.server.nodemanager.NodeStatusUpdaterImpl.serviceStart(NodeStatusUpdaterImpl.java:236)
	at org.apache.hadoop.service.AbstractService.start(AbstractService.java:193)
	at org.apache.hadoop.yarn.server.nodemanager.containermanager.BaseContainerManagerTest.setup(BaseContainerManagerTest.java:188)
	at org.apache.hadoop.yarn.server.nodemanager.containermanager.launcher.TestContainerLaunch.setup(TestContainerLaunch.java:130)


FAILED:  org.apache.hadoop.yarn.server.nodemanager.containermanager.launcher.TestContainerLaunch.testWindowsShellScriptBuilderLink

Error Message:
java.lang.NullPointerException

Stack Trace:
org.apache.hadoop.yarn.exceptions.YarnRuntimeException: java.lang.NullPointerException
	at org.apache.hadoop.yarn.server.nodemanager.NodeStatusUpdaterImpl.serviceStart(NodeStatusUpdaterImpl.java:236)
	at org.apache.hadoop.service.AbstractService.start(AbstractService.java:193)
	at org.apache.hadoop.yarn.server.nodemanager.containermanager.BaseContainerManagerTest.setup(BaseContainerManagerTest.java:188)
	at org.apache.hadoop.yarn.server.nodemanager.containermanager.launcher.TestContainerLaunch.setup(TestContainerLaunch.java:130)


FAILED:  org.apache.hadoop.yarn.server.nodemanager.containermanager.launcher.TestContainerLaunch.testWindowsShellScriptBuilderCommand

Error Message:
java.lang.NullPointerException

Stack Trace:
org.apache.hadoop.yarn.exceptions.YarnRuntimeException: java.lang.NullPointerException
	at org.apache.hadoop.yarn.server.nodemanager.NodeStatusUpdaterImpl.serviceStart(NodeStatusUpdaterImpl.java:236)
	at org.apache.hadoop.service.AbstractService.start(AbstractService.java:193)
	at org.apache.hadoop.yarn.server.nodemanager.containermanager.BaseContainerManagerTest.setup(BaseContainerManagerTest.java:188)
	at org.apache.hadoop.yarn.server.nodemanager.containermanager.launcher.TestContainerLaunch.setup(TestContainerLaunch.java:130)


FAILED:  org.apache.hadoop.yarn.server.nodemanager.containermanager.launcher.TestContainerLaunch.testKillProcessGroup

Error Message:
java.lang.NullPointerException

Stack Trace:
org.apache.hadoop.yarn.exceptions.YarnRuntimeException: java.lang.NullPointerException
	at org.apache.hadoop.yarn.server.nodemanager.NodeStatusUpdaterImpl.serviceStart(NodeStatusUpdaterImpl.java:236)
	at org.apache.hadoop.service.AbstractService.start(AbstractService.java:193)
	at org.apache.hadoop.yarn.server.nodemanager.containermanager.BaseContainerManagerTest.setup(BaseContainerManagerTest.java:188)
	at org.apache.hadoop.yarn.server.nodemanager.containermanager.launcher.TestContainerLaunch.setup(TestContainerLaunch.java:130)


FAILED:  org.apache.hadoop.yarn.server.nodemanager.containermanager.launcher.TestContainerLaunch.testEnvExpansion

Error Message:
java.lang.NullPointerException

Stack Trace:
org.apache.hadoop.yarn.exceptions.YarnRuntimeException: java.lang.NullPointerException
	at org.apache.hadoop.yarn.server.nodemanager.NodeStatusUpdaterImpl.serviceStart(NodeStatusUpdaterImpl.java:236)
	at org.apache.hadoop.service.AbstractService.start(AbstractService.java:193)
	at org.apache.hadoop.yarn.server.nodemanager.containermanager.BaseContainerManagerTest.setup(BaseContainerManagerTest.java:188)
	at org.apache.hadoop.yarn.server.nodemanager.containermanager.launcher.TestContainerLaunch.setup(TestContainerLaunch.java:130)


FAILED:  org.apache.hadoop.yarn.server.nodemanager.containermanager.launcher.TestContainerLaunch.testContainerLaunchStdoutAndStderrDiagnostics

Error Message:
java.lang.NullPointerException

Stack Trace:
org.apache.hadoop.yarn.exceptions.YarnRuntimeException: java.lang.NullPointerException
	at org.apache.hadoop.yarn.server.nodemanager.NodeStatusUpdaterImpl.serviceStart(NodeStatusUpdaterImpl.java:236)
	at org.apache.hadoop.service.AbstractService.start(AbstractService.java:193)
	at org.apache.hadoop.yarn.server.nodemanager.containermanager.BaseContainerManagerTest.setup(BaseContainerManagerTest.java:188)
	at org.apache.hadoop.yarn.server.nodemanager.containermanager.launcher.TestContainerLaunch.setup(TestContainerLaunch.java:130)


FAILED:  org.apache.hadoop.yarn.server.nodemanager.containermanager.launcher.TestContainerLaunch.testCallFailureWithNullLocalizedResources

Error Message:
java.lang.NullPointerException

Stack Trace:
org.apache.hadoop.yarn.exceptions.YarnRuntimeException: java.lang.NullPointerException
	at org.apache.hadoop.yarn.server.nodemanager.NodeStatusUpdaterImpl.serviceStart(NodeStatusUpdaterImpl.java:236)
	at org.apache.hadoop.service.AbstractService.start(AbstractService.java:193)
	at org.apache.hadoop.yarn.server.nodemanager.containermanager.BaseContainerManagerTest.setup(BaseContainerManagerTest.java:188)
	at org.apache.hadoop.yarn.server.nodemanager.containermanager.launcher.TestContainerLaunch.setup(TestContainerLaunch.java:130)


FAILED:  org.apache.hadoop.yarn.server.nodemanager.containermanager.launcher.TestContainerLaunch.testInvalidSymlinkDiagnostics

Error Message:
java.lang.NullPointerException

Stack Trace:
org.apache.hadoop.yarn.exceptions.YarnRuntimeException: java.lang.NullPointerException
	at org.apache.hadoop.yarn.server.nodemanager.NodeStatusUpdaterImpl.serviceStart(NodeStatusUpdaterImpl.java:236)
	at org.apache.hadoop.service.AbstractService.start(AbstractService.java:193)
	at org.apache.hadoop.yarn.server.nodemanager.containermanager.BaseContainerManagerTest.setup(BaseContainerManagerTest.java:188)
	at org.apache.hadoop.yarn.server.nodemanager.containermanager.launcher.TestContainerLaunch.setup(TestContainerLaunch.java:130)


FAILED:  org.apache.hadoop.yarn.server.nodemanager.containermanager.logaggregation.TestLogAggregationService.testStopAfterError

Error Message:
java.lang.NullPointerException

Stack Trace:
org.apache.hadoop.yarn.exceptions.YarnRuntimeException: java.lang.NullPointerException
	at org.apache.hadoop.yarn.server.nodemanager.NodeStatusUpdaterImpl.serviceStart(NodeStatusUpdaterImpl.java:236)
	at org.apache.hadoop.service.AbstractService.start(AbstractService.java:193)
	at org.apache.hadoop.yarn.server.nodemanager.containermanager.BaseContainerManagerTest.setup(BaseContainerManagerTest.java:188)
	at org.apache.hadoop.yarn.server.nodemanager.containermanager.logaggregation.TestLogAggregationService.setup(TestLogAggregationService.java:157)


FAILED:  org.apache.hadoop.yarn.server.nodemanager.containermanager.logaggregation.TestLogAggregationService.testStopAfterError

Error Message:
null

Stack Trace:
java.lang.NullPointerException: null
	at org.apache.hadoop.yarn.server.nodemanager.containermanager.logaggregation.TestLogAggregationService.tearDown(TestLogAggregationService.java:175)


FAILED:  org.apache.hadoop.yarn.server.nodemanager.containermanager.logaggregation.TestLogAggregationService.testMultipleAppsLogAggregation

Error Message:
java.lang.NullPointerException

Stack Trace:
org.apache.hadoop.yarn.exceptions.YarnRuntimeException: java.lang.NullPointerException
	at org.apache.hadoop.yarn.server.nodemanager.NodeStatusUpdaterImpl.serviceStart(NodeStatusUpdaterImpl.java:236)
	at org.apache.hadoop.service.AbstractService.start(AbstractService.java:193)
	at org.apache.hadoop.yarn.server.nodemanager.containermanager.BaseContainerManagerTest.setup(BaseContainerManagerTest.java:188)
	at org.apache.hadoop.yarn.server.nodemanager.containermanager.logaggregation.TestLogAggregationService.setup(TestLogAggregationService.java:157)


FAILED:  org.apache.hadoop.yarn.server.nodemanager.containermanager.logaggregation.TestLogAggregationService.testMultipleAppsLogAggregation

Error Message:
null

Stack Trace:
java.lang.NullPointerException: null
	at org.apache.hadoop.yarn.server.nodemanager.containermanager.logaggregation.TestLogAggregationService.tearDown(TestLogAggregationService.java:175)


FAILED:  org.apache.hadoop.yarn.server.nodemanager.containermanager.logaggregation.TestLogAggregationService.testVerifyAndCreateRemoteDirNonExistence

Error Message:
java.lang.NullPointerException

Stack Trace:
org.apache.hadoop.yarn.exceptions.YarnRuntimeException: java.lang.NullPointerException
	at org.apache.hadoop.yarn.server.nodemanager.NodeStatusUpdaterImpl.serviceStart(NodeStatusUpdaterImpl.java:236)
	at org.apache.hadoop.service.AbstractService.start(AbstractService.java:193)
	at org.apache.hadoop.yarn.server.nodemanager.containermanager.BaseContainerManagerTest.setup(BaseContainerManagerTest.java:188)
	at org.apache.hadoop.yarn.server.nodemanager.containermanager.logaggregation.TestLogAggregationService.setup(TestLogAggregationService.java:157)


FAILED:  org.apache.hadoop.yarn.server.nodemanager.containermanager.logaggregation.TestLogAggregationService.testVerifyAndCreateRemoteDirNonExistence

Error Message:
null

Stack Trace:
java.lang.NullPointerException: null
	at org.apache.hadoop.yarn.server.nodemanager.containermanager.logaggregation.TestLogAggregationService.tearDown(TestLogAggregationService.java:175)


FAILED:  org.apache.hadoop.yarn.server.nodemanager.containermanager.logaggregation.TestLogAggregationService.testLogAggregationInitAppFailsWithoutKillingNM

Error Message:
java.lang.NullPointerException

Stack Trace:
org.apache.hadoop.yarn.exceptions.YarnRuntimeException: java.lang.NullPointerException
	at org.apache.hadoop.yarn.server.nodemanager.NodeStatusUpdaterImpl.serviceStart(NodeStatusUpdaterImpl.java:236)
	at org.apache.hadoop.service.AbstractService.start(AbstractService.java:193)
	at org.apache.hadoop.yarn.server.nodemanager.containermanager.BaseContainerManagerTest.setup(BaseContainerManagerTest.java:188)
	at org.apache.hadoop.yarn.server.nodemanager.containermanager.logaggregation.TestLogAggregationService.setup(TestLogAggregationService.java:157)


FAILED:  org.apache.hadoop.yarn.server.nodemanager.containermanager.logaggregation.TestLogAggregationService.testLogAggregationInitAppFailsWithoutKillingNM

Error Message:
null

Stack Trace:
java.lang.NullPointerException: null
	at org.apache.hadoop.yarn.server.nodemanager.containermanager.logaggregation.TestLogAggregationService.tearDown(TestLogAggregationService.java:175)


FAILED:  org.apache.hadoop.yarn.server.nodemanager.containermanager.logaggregation.TestLogAggregationService.testNoContainerOnNode

Error Message:
java.lang.NullPointerException

Stack Trace:
org.apache.hadoop.yarn.exceptions.YarnRuntimeException: java.lang.NullPointerException
	at org.apache.hadoop.yarn.server.nodemanager.NodeStatusUpdaterImpl.serviceStart(NodeStatusUpdaterImpl.java:236)
	at org.apache.hadoop.service.AbstractService.start(AbstractService.java:193)
	at org.apache.hadoop.yarn.server.nodemanager.containermanager.BaseContainerManagerTest.setup(BaseContainerManagerTest.java:188)
	at org.apache.hadoop.yarn.server.nodemanager.containermanager.logaggregation.TestLogAggregationService.setup(TestLogAggregationService.java:157)


FAILED:  org.apache.hadoop.yarn.server.nodemanager.containermanager.logaggregation.TestLogAggregationService.testNoContainerOnNode

Error Message:
null

Stack Trace:
java.lang.NullPointerException: null
	at org.apache.hadoop.yarn.server.nodemanager.containermanager.logaggregation.TestLogAggregationService.tearDown(TestLogAggregationService.java:175)


FAILED:  org.apache.hadoop.yarn.server.nodemanager.containermanager.logaggregation.TestLogAggregationService.testAppLogDirCreation

Error Message:
java.lang.NullPointerException

Stack Trace:
org.apache.hadoop.yarn.exceptions.YarnRuntimeException: java.lang.NullPointerException
	at org.apache.hadoop.yarn.server.nodemanager.NodeStatusUpdaterImpl.serviceStart(NodeStatusUpdaterImpl.java:236)
	at org.apache.hadoop.service.AbstractService.start(AbstractService.java:193)
	at org.apache.hadoop.yarn.server.nodemanager.containermanager.BaseContainerManagerTest.setup(BaseContainerManagerTest.java:188)
	at org.apache.hadoop.yarn.server.nodemanager.containermanager.logaggregation.TestLogAggregationService.setup(TestLogAggregationService.java:157)


FAILED:  org.apache.hadoop.yarn.server.nodemanager.containermanager.logaggregation.TestLogAggregationService.testAppLogDirCreation

Error Message:
null

Stack Trace:
java.lang.NullPointerException: null
	at org.apache.hadoop.yarn.server.nodemanager.containermanager.logaggregation.TestLogAggregationService.tearDown(TestLogAggregationService.java:175)


FAILED:  org.apache.hadoop.yarn.server.nodemanager.containermanager.logaggregation.TestLogAggregationService.testLogAggregationCreateDirsFailsWithoutKillingNM

Error Message:
java.lang.NullPointerException

Stack Trace:
org.apache.hadoop.yarn.exceptions.YarnRuntimeException: java.lang.NullPointerException
	at org.apache.hadoop.yarn.server.nodemanager.NodeStatusUpdaterImpl.serviceStart(NodeStatusUpdaterImpl.java:236)
	at org.apache.hadoop.service.AbstractService.start(AbstractService.java:193)
	at org.apache.hadoop.yarn.server.nodemanager.containermanager.BaseContainerManagerTest.setup(BaseContainerManagerTest.java:188)
	at org.apache.hadoop.yarn.server.nodemanager.containermanager.logaggregation.TestLogAggregationService.setup(TestLogAggregationService.java:157)


FAILED:  org.apache.hadoop.yarn.server.nodemanager.containermanager.logaggregation.TestLogAggregationService.testLogAggregationCreateDirsFailsWithoutKillingNM

Error Message:
null

Stack Trace:
java.lang.NullPointerException: null
	at org.apache.hadoop.yarn.server.nodemanager.containermanager.logaggregation.TestLogAggregationService.tearDown(TestLogAggregationService.java:175)


FAILED:  org.apache.hadoop.yarn.server.nodemanager.containermanager.logaggregation.TestLogAggregationService.testLogAggregationServiceWithRetention

Error Message:
java.lang.NullPointerException

Stack Trace:
org.apache.hadoop.yarn.exceptions.YarnRuntimeException: java.lang.NullPointerException
	at org.apache.hadoop.yarn.server.nodemanager.NodeStatusUpdaterImpl.serviceStart(NodeStatusUpdaterImpl.java:236)
	at org.apache.hadoop.service.AbstractService.start(AbstractService.java:193)
	at org.apache.hadoop.yarn.server.nodemanager.containermanager.BaseContainerManagerTest.setup(BaseContainerManagerTest.java:188)
	at org.apache.hadoop.yarn.server.nodemanager.containermanager.logaggregation.TestLogAggregationService.setup(TestLogAggregationService.java:157)


FAILED:  org.apache.hadoop.yarn.server.nodemanager.containermanager.logaggregation.TestLogAggregationService.testLogAggregationServiceWithRetention

Error Message:
null

Stack Trace:
java.lang.NullPointerException: null
	at org.apache.hadoop.yarn.server.nodemanager.containermanager.logaggregation.TestLogAggregationService.tearDown(TestLogAggregationService.java:175)


FAILED:  org.apache.hadoop.yarn.server.nodemanager.containermanager.logaggregation.TestLogAggregationService.testLogAggregationForRealContainerLaunch

Error Message:
java.lang.NullPointerException

Stack Trace:
org.apache.hadoop.yarn.exceptions.YarnRuntimeException: java.lang.NullPointerException
	at org.apache.hadoop.yarn.server.nodemanager.NodeStatusUpdaterImpl.serviceStart(NodeStatusUpdaterImpl.java:236)
	at org.apache.hadoop.service.AbstractService.start(AbstractService.java:193)
	at org.apache.hadoop.yarn.server.nodemanager.containermanager.BaseContainerManagerTest.setup(BaseContainerManagerTest.java:188)
	at org.apache.hadoop.yarn.server.nodemanager.containermanager.logaggregation.TestLogAggregationService.setup(TestLogAggregationService.java:157)


FAILED:  org.apache.hadoop.yarn.server.nodemanager.containermanager.logaggregation.TestLogAggregationService.testLogAggregationForRealContainerLaunch

Error Message:
null

Stack Trace:
java.lang.NullPointerException: null
	at org.apache.hadoop.yarn.server.nodemanager.containermanager.logaggregation.TestLogAggregationService.tearDown(TestLogAggregationService.java:175)


FAILED:  org.apache.hadoop.yarn.server.nodemanager.containermanager.logaggregation.TestLogAggregationService.testLogAggregatorCleanup

Error Message:
java.lang.NullPointerException

Stack Trace:
org.apache.hadoop.yarn.exceptions.YarnRuntimeException: java.lang.NullPointerException
	at org.apache.hadoop.yarn.server.nodemanager.NodeStatusUpdaterImpl.serviceStart(NodeStatusUpdaterImpl.java:236)
	at org.apache.hadoop.service.AbstractService.start(AbstractService.java:193)
	at org.apache.hadoop.yarn.server.nodemanager.containermanager.BaseContainerManagerTest.setup(BaseContainerManagerTest.java:188)
	at org.apache.hadoop.yarn.server.nodemanager.containermanager.logaggregation.TestLogAggregationService.setup(TestLogAggregationService.java:157)


FAILED:  org.apache.hadoop.yarn.server.nodemanager.containermanager.logaggregation.TestLogAggregationService.testLogAggregatorCleanup

Error Message:
null

Stack Trace:
java.lang.NullPointerException: null
	at org.apache.hadoop.yarn.server.nodemanager.containermanager.logaggregation.TestLogAggregationService.tearDown(TestLogAggregationService.java:175)


FAILED:  org.apache.hadoop.yarn.server.nodemanager.containermanager.logaggregation.TestLogAggregationService.testLogAggregationServiceWithInterval

Error Message:
java.lang.NullPointerException

Stack Trace:
org.apache.hadoop.yarn.exceptions.YarnRuntimeException: java.lang.NullPointerException
	at org.apache.hadoop.yarn.server.nodemanager.NodeStatusUpdaterImpl.serviceStart(NodeStatusUpdaterImpl.java:236)
	at org.apache.hadoop.service.AbstractService.start(AbstractService.java:193)
	at org.apache.hadoop.yarn.server.nodemanager.containermanager.BaseContainerManagerTest.setup(BaseContainerManagerTest.java:188)
	at org.apache.hadoop.yarn.server.nodemanager.containermanager.logaggregation.TestLogAggregationService.setup(TestLogAggregationService.java:157)


FAILED:  org.apache.hadoop.yarn.server.nodemanager.containermanager.logaggregation.TestLogAggregationService.testLogAggregationServiceWithInterval

Error Message:
null

Stack Trace:
java.lang.NullPointerException: null
	at org.apache.hadoop.yarn.server.nodemanager.containermanager.logaggregation.TestLogAggregationService.tearDown(TestLogAggregationService.java:175)


FAILED:  org.apache.hadoop.yarn.server.nodemanager.containermanager.logaggregation.TestLogAggregationService.testAddNewTokenSentFromRMForLogAggregation

Error Message:
java.lang.NullPointerException

Stack Trace:
org.apache.hadoop.yarn.exceptions.YarnRuntimeException: java.lang.NullPointerException
	at org.apache.hadoop.yarn.server.nodemanager.NodeStatusUpdaterImpl.serviceStart(NodeStatusUpdaterImpl.java:236)
	at org.apache.hadoop.service.AbstractService.start(AbstractService.java:193)
	at org.apache.hadoop.yarn.server.nodemanager.containermanager.BaseContainerManagerTest.setup(BaseContainerManagerTest.java:188)
	at org.apache.hadoop.yarn.server.nodemanager.containermanager.logaggregation.TestLogAggregationService.setup(TestLogAggregationService.java:157)


FAILED:  org.apache.hadoop.yarn.server.nodemanager.containermanager.logaggregation.TestLogAggregationService.testAddNewTokenSentFromRMForLogAggregation

Error Message:
null

Stack Trace:
java.lang.NullPointerException: null
	at org.apache.hadoop.yarn.server.nodemanager.containermanager.logaggregation.TestLogAggregationService.tearDown(TestLogAggregationService.java:175)


FAILED:  org.apache.hadoop.yarn.server.nodemanager.containermanager.logaggregation.TestLogAggregationService.testLogAggregationServiceWithPatterns

Error Message:
java.lang.NullPointerException

Stack Trace:
org.apache.hadoop.yarn.exceptions.YarnRuntimeException: java.lang.NullPointerException
	at org.apache.hadoop.yarn.server.nodemanager.NodeStatusUpdaterImpl.serviceStart(NodeStatusUpdaterImpl.java:236)
	at org.apache.hadoop.service.AbstractService.start(AbstractService.java:193)
	at org.apache.hadoop.yarn.server.nodemanager.containermanager.BaseContainerManagerTest.setup(BaseContainerManagerTest.java:188)
	at org.apache.hadoop.yarn.server.nodemanager.containermanager.logaggregation.TestLogAggregationService.setup(TestLogAggregationService.java:157)


FAILED:  org.apache.hadoop.yarn.server.nodemanager.containermanager.logaggregation.TestLogAggregationService.testLogAggregationServiceWithPatterns

Error Message:
null

Stack Trace:
java.lang.NullPointerException: null
	at org.apache.hadoop.yarn.server.nodemanager.containermanager.logaggregation.TestLogAggregationService.tearDown(TestLogAggregationService.java:175)


FAILED:  org.apache.hadoop.yarn.server.nodemanager.containermanager.logaggregation.TestLogAggregationService.testVerifyAndCreateRemoteDirsFailure

Error Message:
java.lang.NullPointerException

Stack Trace:
org.apache.hadoop.yarn.exceptions.YarnRuntimeException: java.lang.NullPointerException
	at org.apache.hadoop.yarn.server.nodemanager.NodeStatusUpdaterImpl.serviceStart(NodeStatusUpdaterImpl.java:236)
	at org.apache.hadoop.service.AbstractService.start(AbstractService.java:193)
	at org.apache.hadoop.yarn.server.nodemanager.containermanager.BaseContainerManagerTest.setup(BaseContainerManagerTest.java:188)
	at org.apache.hadoop.yarn.server.nodemanager.containermanager.logaggregation.TestLogAggregationService.setup(TestLogAggregationService.java:157)


FAILED:  org.apache.hadoop.yarn.server.nodemanager.containermanager.logaggregation.TestLogAggregationService.testVerifyAndCreateRemoteDirsFailure

Error Message:
null

Stack Trace:
java.lang.NullPointerException: null
	at org.apache.hadoop.yarn.server.nodemanager.containermanager.logaggregation.TestLogAggregationService.tearDown(TestLogAggregationService.java:175)


FAILED:  org.apache.hadoop.yarn.server.nodemanager.containermanager.logaggregation.TestLogAggregationService.testLocalFileDeletionOnDiskFull

Error Message:
java.lang.NullPointerException

Stack Trace:
org.apache.hadoop.yarn.exceptions.YarnRuntimeException: java.lang.NullPointerException
	at org.apache.hadoop.yarn.server.nodemanager.NodeStatusUpdaterImpl.serviceStart(NodeStatusUpdaterImpl.java:236)
	at org.apache.hadoop.service.AbstractService.start(AbstractService.java:193)
	at org.apache.hadoop.yarn.server.nodemanager.containermanager.BaseContainerManagerTest.setup(BaseContainerManagerTest.java:188)
	at org.apache.hadoop.yarn.server.nodemanager.containermanager.logaggregation.TestLogAggregationService.setup(TestLogAggregationService.java:157)


FAILED:  org.apache.hadoop.yarn.server.nodemanager.containermanager.logaggregation.TestLogAggregationService.testLocalFileDeletionOnDiskFull

Error Message:
null

Stack Trace:
java.lang.NullPointerException: null
	at org.apache.hadoop.yarn.server.nodemanager.containermanager.logaggregation.TestLogAggregationService.tearDown(TestLogAggregationService.java:175)


FAILED:  org.apache.hadoop.yarn.server.nodemanager.containermanager.logaggregation.TestLogAggregationService.testLocalFileDeletionAfterUpload

Error Message:
java.lang.NullPointerException

Stack Trace:
org.apache.hadoop.yarn.exceptions.YarnRuntimeException: java.lang.NullPointerException
	at org.apache.hadoop.yarn.server.nodemanager.NodeStatusUpdaterImpl.serviceStart(NodeStatusUpdaterImpl.java:236)
	at org.apache.hadoop.service.AbstractService.start(AbstractService.java:193)
	at org.apache.hadoop.yarn.server.nodemanager.containermanager.BaseContainerManagerTest.setup(BaseContainerManagerTest.java:188)
	at org.apache.hadoop.yarn.server.nodemanager.containermanager.logaggregation.TestLogAggregationService.setup(TestLogAggregationService.java:157)


FAILED:  org.apache.hadoop.yarn.server.nodemanager.containermanager.logaggregation.TestLogAggregationService.testLocalFileDeletionAfterUpload

Error Message:
null

Stack Trace:
java.lang.NullPointerException: null
	at org.apache.hadoop.yarn.server.nodemanager.containermanager.logaggregation.TestLogAggregationService.tearDown(TestLogAggregationService.java:175)


FAILED:  org.apache.hadoop.yarn.server.nodemanager.containermanager.logaggregation.TestLogAggregationService.testFailedDirsLocalFileDeletionAfterUpload

Error Message:
java.lang.NullPointerException

Stack Trace:
org.apache.hadoop.yarn.exceptions.YarnRuntimeException: java.lang.NullPointerException
	at org.apache.hadoop.yarn.server.nodemanager.NodeStatusUpdaterImpl.serviceStart(NodeStatusUpdaterImpl.java:236)
	at org.apache.hadoop.service.AbstractService.start(AbstractService.java:193)
	at org.apache.hadoop.yarn.server.nodemanager.containermanager.BaseContainerManagerTest.setup(BaseContainerManagerTest.java:188)
	at org.apache.hadoop.yarn.server.nodemanager.containermanager.logaggregation.TestLogAggregationService.setup(TestLogAggregationService.java:157)


FAILED:  org.apache.hadoop.yarn.server.nodemanager.containermanager.logaggregation.TestLogAggregationService.testFailedDirsLocalFileDeletionAfterUpload

Error Message:
null

Stack Trace:
java.lang.NullPointerException: null
	at org.apache.hadoop.yarn.server.nodemanager.containermanager.logaggregation.TestLogAggregationService.tearDown(TestLogAggregationService.java:175)


FAILED:  org.apache.hadoop.yarn.server.nodemanager.containermanager.monitor.TestContainersMonitor.testProcessTreeLimits

Error Message:
java.lang.NullPointerException

Stack Trace:
org.apache.hadoop.yarn.exceptions.YarnRuntimeException: java.lang.NullPointerException
	at org.apache.hadoop.yarn.server.nodemanager.NodeStatusUpdaterImpl.serviceStart(NodeStatusUpdaterImpl.java:236)
	at org.apache.hadoop.service.AbstractService.start(AbstractService.java:193)
	at org.apache.hadoop.yarn.server.nodemanager.containermanager.BaseContainerManagerTest.setup(BaseContainerManagerTest.java:188)
	at org.apache.hadoop.yarn.server.nodemanager.containermanager.monitor.TestContainersMonitor.setup(TestContainersMonitor.java:92)


FAILED:  org.apache.hadoop.yarn.server.nodemanager.containermanager.monitor.TestContainersMonitor.testContainerMonitorMemFlags

Error Message:
java.lang.NullPointerException

Stack Trace:
org.apache.hadoop.yarn.exceptions.YarnRuntimeException: java.lang.NullPointerException
	at org.apache.hadoop.yarn.server.nodemanager.NodeStatusUpdaterImpl.serviceStart(NodeStatusUpdaterImpl.java:236)
	at org.apache.hadoop.service.AbstractService.start(AbstractService.java:193)
	at org.apache.hadoop.yarn.server.nodemanager.containermanager.BaseContainerManagerTest.setup(BaseContainerManagerTest.java:188)
	at org.apache.hadoop.yarn.server.nodemanager.containermanager.monitor.TestContainersMonitor.setup(TestContainersMonitor.java:92)


FAILED:  org.apache.hadoop.yarn.server.nodemanager.containermanager.monitor.TestContainersMonitor.testContainerKillOnMemoryOverflow

Error Message:
java.lang.NullPointerException

Stack Trace:
org.apache.hadoop.yarn.exceptions.YarnRuntimeException: java.lang.NullPointerException
	at org.apache.hadoop.yarn.server.nodemanager.NodeStatusUpdaterImpl.serviceStart(NodeStatusUpdaterImpl.java:236)
	at org.apache.hadoop.service.AbstractService.start(AbstractService.java:193)
	at org.apache.hadoop.yarn.server.nodemanager.containermanager.BaseContainerManagerTest.setup(BaseContainerManagerTest.java:188)
	at org.apache.hadoop.yarn.server.nodemanager.containermanager.monitor.TestContainersMonitor.setup(TestContainersMonitor.java:92)


FAILED:  org.apache.hadoop.yarn.server.resourcemanager.TestAppManager.testEscapeApplicationSummary

Error Message:
null

Stack Trace:
java.lang.AssertionError: null
	at org.junit.Assert.fail(Assert.java:86)
	at org.junit.Assert.assertTrue(Assert.java:41)
	at org.junit.Assert.assertTrue(Assert.java:52)
	at org.apache.hadoop.yarn.server.resourcemanager.TestAppManager.testEscapeApplicationSummary(TestAppManager.java:656)


FAILED:  org.apache.hadoop.yarn.server.resourcemanager.webapp.TestRMWebServicesCapacitySched.testResourceInfo

Error Message:
expected:<<memory:10, vCores:1[>]> but was:<<memory:10, vCores:1[]>

Stack Trace:
org.junit.ComparisonFailure: expected:<<memory:10, vCores:1[>]> but was:<<memory:10, vCores:1[]>
	at org.junit.Assert.assertEquals(Assert.java:115)
	at org.junit.Assert.assertEquals(Assert.java:144)
	at org.apache.hadoop.yarn.server.resourcemanager.webapp.TestRMWebServicesCapacitySched.testResourceInfo(TestRMWebServicesCapacitySched.java:600)



Mime
  • Unnamed multipart/mixed (inline, None, 0 bytes)
View raw message