hadoop-yarn-dev mailing list archives

Site index · List index
Message view « Date » · « Thread »
Top « Date » · « Thread »
From Apache Jenkins Server <jenk...@builds.apache.org>
Subject Failed: YARN-3896 PreCommit Build #8496
Date Fri, 10 Jul 2015 14:00:30 GMT
Jira: https://issues.apache.org/jira/browse/YARN-3896
Build: https://builds.apache.org/job/PreCommit-YARN-Build/8496/

###################################################################################
########################## LAST 60 LINES OF THE CONSOLE ###########################
[...truncated 324 lines...]
|      |                        |            | eclipse:eclipse.
|  +1  |              findbugs  |  2m 14s    | The patch does not introduce any 
|      |                        |            | new Findbugs (version 3.0.0)
|      |                        |            | warnings.
|  +1  |    tools/hadoop tests  |  0m 52s    | Tests passed in hadoop-sls. 
|  -1  |            yarn tests  |  51m 3s    | Tests failed in 
|      |                        |            | hadoop-yarn-server-resourcemanager
|      |                        |            | .
|      |                        |  91m 32s   | 


             Reason | Tests
 Failed unit tests  |  hadoop.yarn.server.resourcemanager.rmapp.TestRMAppTransitions 
                    |  hadoop.yarn.server.resourcemanager.applicationsmanager.TestAMRMRPCNodeUpdates



|| Subsystem || Report/Notes ||
============================================================================
| Patch URL | http://issues.apache.org/jira/secure/attachment/12744706/YARN-3896.03.patch
|
| Optional Tests | javadoc javac unit findbugs checkstyle |
| git revision | trunk / b489080 |
| whitespace | /home/jenkins/jenkins-slave/workspace/PreCommit-YARN-Build/patchprocess/whitespace.txt
|
| hadoop-sls test log | /home/jenkins/jenkins-slave/workspace/PreCommit-YARN-Build/patchprocess/testrun_hadoop-sls.txt
|
| hadoop-yarn-server-resourcemanager test log | /home/jenkins/jenkins-slave/workspace/PreCommit-YARN-Build/patchprocess/testrun_hadoop-yarn-server-resourcemanager.txt
|
| Test Results | https://builds.apache.org/job/PreCommit-YARN-Build/8496/testReport/ |
| Java | 1.7.0_55 |
| uname | Linux asf905.gq1.ygridcore.net 3.13.0-36-lowlatency #63-Ubuntu SMP PREEMPT Wed Sep
3 21:56:12 UTC 2014 x86_64 x86_64 x86_64 GNU/Linux |


============================================================================
============================================================================
                          Adding comment to JIRA
============================================================================
============================================================================


Comment added.
d4fca61308eb0e3cd73e8963628223c5207fcfb6 logged out


============================================================================
============================================================================
                              Finished build.
============================================================================
============================================================================


Build step 'Execute shell' marked build as failure
Archiving artifacts
Sending artifact delta relative to PreCommit-YARN-Build #8480
Archived 43 artifacts
Archive block size is 32768
Received 298 blocks and 3469981 bytes
Compression is 73.8%
Took 8.3 sec
[description-setter] Could not determine description.
Recording test results
Email was triggered for: Failure
Sending email for trigger: Failure



###################################################################################
############################## FAILED TESTS (if any) ##############################
3 tests failed.
FAILED:  org.apache.hadoop.yarn.server.resourcemanager.applicationsmanager.TestAMRMRPCNodeUpdates.testAMRMUnusableNodes

Error Message:
expected:<1> but was:<0>

Stack Trace:
java.lang.AssertionError: expected:<1> but was:<0>
	at org.junit.Assert.fail(Assert.java:88)
	at org.junit.Assert.failNotEquals(Assert.java:743)
	at org.junit.Assert.assertEquals(Assert.java:118)
	at org.junit.Assert.assertEquals(Assert.java:555)
	at org.junit.Assert.assertEquals(Assert.java:542)
	at org.apache.hadoop.yarn.server.resourcemanager.applicationsmanager.TestAMRMRPCNodeUpdates.testAMRMUnusableNodes(TestAMRMRPCNodeUpdates.java:156)


FAILED:  org.apache.hadoop.yarn.server.resourcemanager.rmapp.TestRMAppTransitions.testAppAcceptedAttemptKilled[0]

Error Message:
expected:<APP_REMOVED> but was:<APP_ATTEMPT_ADDED>

Stack Trace:
java.lang.AssertionError: expected:<APP_REMOVED> but was:<APP_ATTEMPT_ADDED>
	at org.junit.Assert.fail(Assert.java:88)
	at org.junit.Assert.failNotEquals(Assert.java:743)
	at org.junit.Assert.assertEquals(Assert.java:118)
	at org.junit.Assert.assertEquals(Assert.java:144)
	at org.apache.hadoop.yarn.server.resourcemanager.rmapp.TestRMAppTransitions.verifyAppRemovedSchedulerEvent(TestRMAppTransitions.java:1032)
	at org.apache.hadoop.yarn.server.resourcemanager.rmapp.TestRMAppTransitions.testAppAcceptedAttemptKilled(TestRMAppTransitions.java:742)


FAILED:  org.apache.hadoop.yarn.server.resourcemanager.rmapp.TestRMAppTransitions.testAppAcceptedAttemptKilled[1]

Error Message:
expected:<APP_REMOVED> but was:<APP_ATTEMPT_ADDED>

Stack Trace:
java.lang.AssertionError: expected:<APP_REMOVED> but was:<APP_ATTEMPT_ADDED>
	at org.junit.Assert.fail(Assert.java:88)
	at org.junit.Assert.failNotEquals(Assert.java:743)
	at org.junit.Assert.assertEquals(Assert.java:118)
	at org.junit.Assert.assertEquals(Assert.java:144)
	at org.apache.hadoop.yarn.server.resourcemanager.rmapp.TestRMAppTransitions.verifyAppRemovedSchedulerEvent(TestRMAppTransitions.java:1032)
	at org.apache.hadoop.yarn.server.resourcemanager.rmapp.TestRMAppTransitions.testAppAcceptedAttemptKilled(TestRMAppTransitions.java:742)



Mime
  • Unnamed multipart/mixed (inline, None, 0 bytes)
View raw message