hadoop-yarn-dev mailing list archives

Site index · List index
Message view « Date » · « Thread »
Top « Date » · « Thread »
From Apache Jenkins Server <jenk...@builds.apache.org>
Subject Failed: YARN-3867 PreCommit Build #8656
Date Fri, 24 Jul 2015 21:11:32 GMT
Jira: https://issues.apache.org/jira/browse/YARN-3867
Build: https://builds.apache.org/job/PreCommit-YARN-Build/8656/

###################################################################################
########################## LAST 60 LINES OF THE CONSOLE ###########################
[...truncated 405 lines...]
|      |                     |            | warnings.
|  +1  |         yarn tests  |  0m 29s    | Tests passed in 
|      |                     |            | hadoop-yarn-server-common.
|  -1  |         yarn tests  |  6m 22s    | Tests failed in 
|      |                     |            | hadoop-yarn-server-nodemanager.
|  +1  |         yarn tests  |  53m 46s   | Tests passed in 
|      |                     |            | hadoop-yarn-server-resourcemanager.
|      |                     |  110m 3s   | 


             Reason | Tests
 Failed unit tests  |  hadoop.yarn.server.nodemanager.TestDeletionService 
   Timed out tests  |  org.apache.hadoop.yarn.server.nodemanager.containermanager.application.TestApplication



|| Subsystem || Report/Notes ||
============================================================================
| Patch URL | http://issues.apache.org/jira/secure/attachment/12747093/YARN-3867-YARN-1197.4.patch
|
| Optional Tests | javadoc javac unit findbugs checkstyle |
| git revision | YARN-1197 / 2934ff3 |
| Pre-patch Findbugs warnings | /home/jenkins/jenkins-slave/workspace/PreCommit-YARN-Build/patchprocess/YARN-1197FindbugsWarningshadoop-yarn-server-common.html
|
| hadoop-yarn-server-common test log | /home/jenkins/jenkins-slave/workspace/PreCommit-YARN-Build/patchprocess/testrun_hadoop-yarn-server-common.txt
|
| hadoop-yarn-server-nodemanager test log | /home/jenkins/jenkins-slave/workspace/PreCommit-YARN-Build/patchprocess/testrun_hadoop-yarn-server-nodemanager.txt
|
| hadoop-yarn-server-resourcemanager test log | /home/jenkins/jenkins-slave/workspace/PreCommit-YARN-Build/patchprocess/testrun_hadoop-yarn-server-resourcemanager.txt
|
| Test Results | https://builds.apache.org/job/PreCommit-YARN-Build/8656/testReport/ |
| Java | 1.7.0_55 |
| uname | Linux asf903.gq1.ygridcore.net 3.13.0-36-lowlatency #63-Ubuntu SMP PREEMPT Wed Sep
3 21:56:12 UTC 2014 x86_64 x86_64 x86_64 GNU/Linux |


============================================================================
============================================================================
                          Adding comment to JIRA
============================================================================
============================================================================


Comment added.
7fe9c6c0d133f75c6ca85d6718410d09e7fd41ac logged out


============================================================================
============================================================================
                              Finished build.
============================================================================
============================================================================


Build step 'Execute shell' marked build as failure
Archiving artifacts
Sending artifact delta relative to PreCommit-YARN-Build #8652
Archived 53 artifacts
Archive block size is 32768
Received 25 blocks and 11241574 bytes
Compression is 6.8%
Took 3.3 sec
[description-setter] Could not determine description.
Recording test results
Email was triggered for: Failure
Sending email for trigger: Failure



###################################################################################
############################## FAILED TESTS (if any) ##############################
1 tests failed.
FAILED:  org.apache.hadoop.yarn.server.nodemanager.TestDeletionService.testRelativeDelete

Error Message:
/home/jenkins/jenkins-slave/workspace/PreCommit-YARN-Build/hadoop-yarn-project/hadoop-yarn/hadoop-yarn-server/hadoop-yarn-server-nodemanager/target/org.apache.hadoop.yarn.server.nodemanager.TestDeletionService/-931019772730545814/-5873089720749285702/-791784139580480955

Stack Trace:
java.nio.file.NoSuchFileException: /home/jenkins/jenkins-slave/workspace/PreCommit-YARN-Build/hadoop-yarn-project/hadoop-yarn/hadoop-yarn-server/hadoop-yarn-server-nodemanager/target/org.apache.hadoop.yarn.server.nodemanager.TestDeletionService/-931019772730545814/-5873089720749285702/-791784139580480955
	at sun.nio.fs.UnixException.translateToIOException(UnixException.java:86)
	at sun.nio.fs.UnixException.rethrowAsIOException(UnixException.java:102)
	at sun.nio.fs.UnixException.rethrowAsIOException(UnixException.java:107)
	at sun.nio.fs.UnixFileAttributeViews$Basic.readAttributes(UnixFileAttributeViews.java:55)
	at sun.nio.fs.UnixFileSystemProvider.readAttributes(UnixFileSystemProvider.java:144)
	at sun.nio.fs.LinuxFileSystemProvider.readAttributes(LinuxFileSystemProvider.java:97)
	at java.nio.file.Files.readAttributes(Files.java:1684)
	at org.apache.hadoop.fs.RawLocalFileSystem$DeprecatedRawLocalFileStatus.<init>(RawLocalFileSystem.java:656)
	at org.apache.hadoop.fs.RawLocalFileSystem.deprecatedGetFileStatus(RawLocalFileSystem.java:637)
	at org.apache.hadoop.fs.RawLocalFileSystem.getFileLinkStatusInternal(RawLocalFileSystem.java:853)
	at org.apache.hadoop.fs.RawLocalFileSystem.getFileStatus(RawLocalFileSystem.java:630)
	at org.apache.hadoop.fs.DelegateToFileSystem.getFileStatus(DelegateToFileSystem.java:110)
	at org.apache.hadoop.fs.FilterFs.getFileStatus(FilterFs.java:121)
	at org.apache.hadoop.fs.FileContext$15.next(FileContext.java:1163)
	at org.apache.hadoop.fs.FileContext$15.next(FileContext.java:1159)
	at org.apache.hadoop.fs.FSLinkResolver.resolve(FSLinkResolver.java:90)
	at org.apache.hadoop.fs.FileContext.getFileStatus(FileContext.java:1159)
	at org.apache.hadoop.fs.FileContext$Util.exists(FileContext.java:1624)
	at org.apache.hadoop.yarn.server.nodemanager.TestDeletionService.testRelativeDelete(TestDeletionService.java:170)



Mime
  • Unnamed multipart/mixed (inline, None, 0 bytes)
View raw message