hadoop-yarn-dev mailing list archives

Site index · List index
Message view « Date » · « Thread »
Top « Date » · « Thread »
From Apache Jenkins Server <jenk...@builds.apache.org>
Subject Hadoop-Yarn-trunk-Java8 - Build # 266 - Failure
Date Fri, 24 Jul 2015 12:15:47 GMT
See https://builds.apache.org/job/Hadoop-Yarn-trunk-Java8/266/

###################################################################################
########################## LAST 60 LINES OF THE CONSOLE ###########################
[...truncated 5537 lines...]

Tests run: 14, Failures: 0, Errors: 1, Skipped: 0

[INFO] ------------------------------------------------------------------------
[INFO] Reactor Summary:
[INFO] 
[INFO] Apache Hadoop YARN ................................ SUCCESS [  3.400 s]
[INFO] Apache Hadoop YARN API ............................ SUCCESS [01:21 min]
[INFO] Apache Hadoop YARN Common ......................... SUCCESS [02:16 min]
[INFO] Apache Hadoop YARN Server ......................... SUCCESS [  0.081 s]
[INFO] Apache Hadoop YARN Server Common .................. SUCCESS [ 36.584 s]
[INFO] Apache Hadoop YARN NodeManager .................... SUCCESS [06:14 min]
[INFO] Apache Hadoop YARN Web Proxy ...................... SUCCESS [ 14.826 s]
[INFO] Apache Hadoop YARN ApplicationHistoryService ...... SUCCESS [03:07 min]
[INFO] Apache Hadoop YARN ResourceManager ................ SUCCESS [52:28 min]
[INFO] Apache Hadoop YARN Server Tests ................... SUCCESS [01:52 min]
[INFO] Apache Hadoop YARN Client ......................... SUCCESS [07:03 min]
[INFO] Apache Hadoop YARN SharedCacheManager ............. SUCCESS [ 17.456 s]
[INFO] Apache Hadoop YARN Applications ................... SUCCESS [  0.035 s]
[INFO] Apache Hadoop YARN DistributedShell ............... FAILURE [07:41 min]
[INFO] Apache Hadoop YARN Unmanaged Am Launcher .......... SKIPPED
[INFO] Apache Hadoop YARN Site ........................... SKIPPED
[INFO] Apache Hadoop YARN Registry ....................... SKIPPED
[INFO] Apache Hadoop YARN Project ........................ SKIPPED
[INFO] ------------------------------------------------------------------------
[INFO] BUILD FAILURE
[INFO] ------------------------------------------------------------------------
[INFO] Total time: 01:23 h
[INFO] Finished at: 2015-07-24T12:16:03+00:00
[INFO] Final Memory: 87M/1031M
[INFO] ------------------------------------------------------------------------
[ERROR] Failed to execute goal org.apache.maven.plugins:maven-surefire-plugin:2.17:test (default-test)
on project hadoop-yarn-applications-distributedshell: There are test failures.
[ERROR] 
[ERROR] Please refer to /home/jenkins/jenkins-slave/workspace/Hadoop-Yarn-trunk-Java8/hadoop-yarn-project/hadoop-yarn/hadoop-yarn-applications/hadoop-yarn-applications-distributedshell/target/surefire-reports
for the individual test results.
[ERROR] -> [Help 1]
[ERROR] 
[ERROR] To see the full stack trace of the errors, re-run Maven with the -e switch.
[ERROR] Re-run Maven using the -X switch to enable full debug logging.
[ERROR] 
[ERROR] For more information about the errors and possible solutions, please read the following
articles:
[ERROR] [Help 1] http://cwiki.apache.org/confluence/display/MAVEN/MojoFailureException
[ERROR] 
[ERROR] After correcting the problems, you can resume the build with the command
[ERROR]   mvn <goals> -rf :hadoop-yarn-applications-distributedshell
Build step 'Execute shell' marked build as failure
Archiving artifacts
Recording test results
Updating HADOOP-12161
Updating HADOOP-12009
Updating YARN-3941
Updating HDFS-8730
Updating YARN-3845
Updating HADOOP-12189
Updating HDFS-8806
Updating YARN-3900
Updating HDFS-6682
Sending e-mails to: yarn-dev@hadoop.apache.org
Email was triggered for: Failure
Sending email for trigger: Failure



###################################################################################
############################## FAILED TESTS (if any) ##############################
1 tests failed.
REGRESSION:  org.apache.hadoop.yarn.applications.distributedshell.TestDistributedShell.testDSShellWithDomain

Error Message:
test timed out after 90000 milliseconds

Stack Trace:
java.lang.Exception: test timed out after 90000 milliseconds
	at java.lang.Thread.sleep(Native Method)
	at org.apache.hadoop.yarn.applications.distributedshell.TestDistributedShell.testDSShell(TestDistributedShell.java:215)
	at org.apache.hadoop.yarn.applications.distributedshell.TestDistributedShell.testDSShellWithDomain(TestDistributedShell.java:143)



Mime
  • Unnamed multipart/mixed (inline, None, 0 bytes)
View raw message