hadoop-yarn-dev mailing list archives

Site index · List index
Message view « Date » · « Thread »
Top « Date » · « Thread »
From Apache Jenkins Server <jenk...@builds.apache.org>
Subject Hadoop-Yarn-trunk - Build # 979 - Still Failing
Date Tue, 07 Jul 2015 10:46:25 GMT
See https://builds.apache.org/job/Hadoop-Yarn-trunk/979/

###################################################################################
########################## LAST 60 LINES OF THE CONSOLE ###########################
[...truncated 7458 lines...]

Tests in error: 
  TestDeletionService.testRelativeDelete:170 ยป NoSuchFile /home/jenkins/jenkins-...

Tests run: 323, Failures: 0, Errors: 1, Skipped: 17

[INFO] ------------------------------------------------------------------------
[INFO] Reactor Summary:
[INFO] 
[INFO] Apache Hadoop YARN ................................ SUCCESS [  3.169 s]
[INFO] Apache Hadoop YARN API ............................ SUCCESS [03:36 min]
[INFO] Apache Hadoop YARN Common ......................... SUCCESS [02:58 min]
[INFO] Apache Hadoop YARN Server ......................... SUCCESS [  0.100 s]
[INFO] Apache Hadoop YARN Server Common .................. SUCCESS [ 44.598 s]
[INFO] Apache Hadoop YARN NodeManager .................... FAILURE [05:45 min]
[INFO] Apache Hadoop YARN Web Proxy ...................... SKIPPED
[INFO] Apache Hadoop YARN ApplicationHistoryService ...... SKIPPED
[INFO] Apache Hadoop YARN ResourceManager ................ SKIPPED
[INFO] Apache Hadoop YARN Server Tests ................... SKIPPED
[INFO] Apache Hadoop YARN Client ......................... SKIPPED
[INFO] Apache Hadoop YARN SharedCacheManager ............. SKIPPED
[INFO] Apache Hadoop YARN Applications ................... SKIPPED
[INFO] Apache Hadoop YARN DistributedShell ............... SKIPPED
[INFO] Apache Hadoop YARN Unmanaged Am Launcher .......... SKIPPED
[INFO] Apache Hadoop YARN Site ........................... SKIPPED
[INFO] Apache Hadoop YARN Registry ....................... SKIPPED
[INFO] Apache Hadoop YARN Project ........................ SKIPPED
[INFO] ------------------------------------------------------------------------
[INFO] BUILD FAILURE
[INFO] ------------------------------------------------------------------------
[INFO] Total time: 13:09 min
[INFO] Finished at: 2015-07-07T10:46:25+00:00
[INFO] Final Memory: 72M/955M
[INFO] ------------------------------------------------------------------------
[ERROR] Failed to execute goal org.apache.maven.plugins:maven-surefire-plugin:2.17:test (default-test)
on project hadoop-yarn-server-nodemanager: There are test failures.
[ERROR] 
[ERROR] Please refer to /home/jenkins/jenkins-slave/workspace/Hadoop-Yarn-trunk/hadoop-yarn-project/hadoop-yarn/hadoop-yarn-server/hadoop-yarn-server-nodemanager/target/surefire-reports
for the individual test results.
[ERROR] -> [Help 1]
[ERROR] 
[ERROR] To see the full stack trace of the errors, re-run Maven with the -e switch.
[ERROR] Re-run Maven using the -X switch to enable full debug logging.
[ERROR] 
[ERROR] For more information about the errors and possible solutions, please read the following
articles:
[ERROR] [Help 1] http://cwiki.apache.org/confluence/display/MAVEN/MojoFailureException
[ERROR] 
[ERROR] After correcting the problems, you can resume the build with the command
[ERROR]   mvn <goals> -rf :hadoop-yarn-server-nodemanager
Build step 'Execute shell' marked build as failure
Archiving artifacts
Recording test results
Updating HADOOP-12045
Updating HADOOP-11974
Updating YARN-3837
Updating HDFS-8652
Updating HADOOP-12185
Updating HDFS-8686
Sending e-mails to: yarn-dev@hadoop.apache.org
Email was triggered for: Failure
Sending email for trigger: Failure



###################################################################################
############################## FAILED TESTS (if any) ##############################
1 tests failed.
REGRESSION:  org.apache.hadoop.yarn.server.nodemanager.TestDeletionService.testRelativeDelete

Error Message:
/home/jenkins/jenkins-slave/workspace/Hadoop-Yarn-trunk/hadoop-yarn-project/hadoop-yarn/hadoop-yarn-server/hadoop-yarn-server-nodemanager/target/org.apache.hadoop.yarn.server.nodemanager.TestDeletionService/1369480443411756082/-4239784472829180294/-7656219818046308155

Stack Trace:
java.nio.file.NoSuchFileException: /home/jenkins/jenkins-slave/workspace/Hadoop-Yarn-trunk/hadoop-yarn-project/hadoop-yarn/hadoop-yarn-server/hadoop-yarn-server-nodemanager/target/org.apache.hadoop.yarn.server.nodemanager.TestDeletionService/1369480443411756082/-4239784472829180294/-7656219818046308155
	at sun.nio.fs.UnixException.translateToIOException(UnixException.java:86)
	at sun.nio.fs.UnixException.rethrowAsIOException(UnixException.java:102)
	at sun.nio.fs.UnixException.rethrowAsIOException(UnixException.java:107)
	at sun.nio.fs.UnixFileAttributeViews$Basic.readAttributes(UnixFileAttributeViews.java:55)
	at sun.nio.fs.UnixFileSystemProvider.readAttributes(UnixFileSystemProvider.java:144)
	at sun.nio.fs.LinuxFileSystemProvider.readAttributes(LinuxFileSystemProvider.java:97)
	at java.nio.file.Files.readAttributes(Files.java:1684)
	at org.apache.hadoop.fs.RawLocalFileSystem$DeprecatedRawLocalFileStatus.<init>(RawLocalFileSystem.java:653)
	at org.apache.hadoop.fs.RawLocalFileSystem.deprecatedGetFileStatus(RawLocalFileSystem.java:634)
	at org.apache.hadoop.fs.RawLocalFileSystem.getFileLinkStatusInternal(RawLocalFileSystem.java:850)
	at org.apache.hadoop.fs.RawLocalFileSystem.getFileStatus(RawLocalFileSystem.java:627)
	at org.apache.hadoop.fs.DelegateToFileSystem.getFileStatus(DelegateToFileSystem.java:110)
	at org.apache.hadoop.fs.FilterFs.getFileStatus(FilterFs.java:121)
	at org.apache.hadoop.fs.FileContext$15.next(FileContext.java:1160)
	at org.apache.hadoop.fs.FileContext$15.next(FileContext.java:1156)
	at org.apache.hadoop.fs.FSLinkResolver.resolve(FSLinkResolver.java:90)
	at org.apache.hadoop.fs.FileContext.getFileStatus(FileContext.java:1156)
	at org.apache.hadoop.fs.FileContext$Util.exists(FileContext.java:1621)
	at org.apache.hadoop.yarn.server.nodemanager.TestDeletionService.testRelativeDelete(TestDeletionService.java:170)



Mime
  • Unnamed multipart/mixed (inline, None, 0 bytes)
View raw message