hadoop-yarn-dev mailing list archives

Site index · List index
Message view « Date » · « Thread »
Top « Date » · « Thread »
From Apache Jenkins Server <jenk...@builds.apache.org>
Subject Hadoop-Yarn-trunk-Java8 - Build # 250 - Still Failing
Date Wed, 08 Jul 2015 10:44:19 GMT
See https://builds.apache.org/job/Hadoop-Yarn-trunk-Java8/250/

###################################################################################
########################## LAST 60 LINES OF THE CONSOLE ###########################
[...truncated 4405 lines...]
[INFO] Reactor Summary:
[INFO] 
[INFO] Apache Hadoop YARN ................................ SUCCESS [  3.774 s]
[INFO] Apache Hadoop YARN API ............................ SUCCESS [01:20 min]
[INFO] Apache Hadoop YARN Common ......................... SUCCESS [02:34 min]
[INFO] Apache Hadoop YARN Server ......................... SUCCESS [  0.056 s]
[INFO] Apache Hadoop YARN Server Common .................. SUCCESS [ 39.721 s]
[INFO] Apache Hadoop YARN NodeManager .................... FAILURE [05:57 min]
[INFO] Apache Hadoop YARN Web Proxy ...................... SKIPPED
[INFO] Apache Hadoop YARN ApplicationHistoryService ...... SKIPPED
[INFO] Apache Hadoop YARN ResourceManager ................ SKIPPED
[INFO] Apache Hadoop YARN Server Tests ................... SKIPPED
[INFO] Apache Hadoop YARN Client ......................... SKIPPED
[INFO] Apache Hadoop YARN SharedCacheManager ............. SKIPPED
[INFO] Apache Hadoop YARN Applications ................... SKIPPED
[INFO] Apache Hadoop YARN DistributedShell ............... SKIPPED
[INFO] Apache Hadoop YARN Unmanaged Am Launcher .......... SKIPPED
[INFO] Apache Hadoop YARN Site ........................... SKIPPED
[INFO] Apache Hadoop YARN Registry ....................... SKIPPED
[INFO] Apache Hadoop YARN Project ........................ SKIPPED
[INFO] ------------------------------------------------------------------------
[INFO] BUILD FAILURE
[INFO] ------------------------------------------------------------------------
[INFO] Total time: 10:37 min
[INFO] Finished at: 2015-07-08T10:44:11+00:00
[INFO] Final Memory: 81M/1093M
[INFO] ------------------------------------------------------------------------
[ERROR] Failed to execute goal org.apache.maven.plugins:maven-surefire-plugin:2.17:test (default-test)
on project hadoop-yarn-server-nodemanager: There are test failures.
[ERROR] 
[ERROR] Please refer to /home/jenkins/jenkins-slave/workspace/Hadoop-Yarn-trunk-Java8/hadoop-yarn-project/hadoop-yarn/hadoop-yarn-server/hadoop-yarn-server-nodemanager/target/surefire-reports
for the individual test results.
[ERROR] -> [Help 1]
[ERROR] 
[ERROR] To see the full stack trace of the errors, re-run Maven with the -e switch.
[ERROR] Re-run Maven using the -X switch to enable full debug logging.
[ERROR] 
[ERROR] For more information about the errors and possible solutions, please read the following
articles:
[ERROR] [Help 1] http://cwiki.apache.org/confluence/display/MAVEN/MojoFailureException
[ERROR] 
[ERROR] After correcting the problems, you can resume the build with the command
[ERROR]   mvn <goals> -rf :hadoop-yarn-server-nodemanager
Build step 'Execute shell' marked build as failure
Archiving artifacts
Recording test results
Updating HADOOP-12117
Updating YARN-3892
Updating YARN-2194
Updating HADOOP-5732
Updating HDFS-8620
Updating MCOMPILER-205
Updating MAPREDUCE-6038
Updating HDFS-8652
Updating YARN-3690
Updating HADOOP-12186
Updating HADOOP-12195
Updating HADOOP-12193
Updating HDFS-8711
Sending e-mails to: yarn-dev@hadoop.apache.org
Email was triggered for: Failure
Sending email for trigger: Failure



###################################################################################
############################## FAILED TESTS (if any) ##############################
1 tests failed.
REGRESSION:  org.apache.hadoop.yarn.server.nodemanager.containermanager.linux.privileged.TestPrivilegedOperationExecutor.testSquashCGroupOperationsWithValidOperations

Error Message:
expected:<...n/container_01/tasks[,net_cls/hadoop_yarn/container_01/tasks,]blkio/hadoop_yarn/co...>
but was:<...n/container_01/tasks[%net_cls/hadoop_yarn/container_01/tasks%]blkio/hadoop_yarn/co...>

Stack Trace:
org.junit.ComparisonFailure: expected:<...n/container_01/tasks[,net_cls/hadoop_yarn/container_01/tasks,]blkio/hadoop_yarn/co...>
but was:<...n/container_01/tasks[%net_cls/hadoop_yarn/container_01/tasks%]blkio/hadoop_yarn/co...>
	at org.junit.Assert.assertEquals(Assert.java:115)
	at org.junit.Assert.assertEquals(Assert.java:144)
	at org.apache.hadoop.yarn.server.nodemanager.containermanager.linux.privileged.TestPrivilegedOperationExecutor.testSquashCGroupOperationsWithValidOperations(TestPrivilegedOperationExecutor.java:227)



Mime
  • Unnamed multipart/mixed (inline, None, 0 bytes)
View raw message