hadoop-yarn-dev mailing list archives

Site index · List index
Message view « Date » · « Thread »
Top « Date » · « Thread »
From Apache Jenkins Server <jenk...@builds.apache.org>
Subject Failed: YARN-1644 PreCommit Build #8614
Date Wed, 22 Jul 2015 17:04:24 GMT
Jira: https://issues.apache.org/jira/browse/YARN-1644
Build: https://builds.apache.org/job/PreCommit-YARN-Build/8614/

###################################################################################
########################## LAST 60 LINES OF THE CONSOLE ###########################
[...truncated 369 lines...]
|      |                     |            | warnings.
|  +1  |         yarn tests  |  6m 57s    | Tests passed in hadoop-yarn-client. 
|  +1  |         yarn tests  |  0m 24s    | Tests passed in 
|      |                     |            | hadoop-yarn-server-common.
|  -1  |         yarn tests  |  6m 18s    | Tests failed in 
|      |                     |            | hadoop-yarn-server-nodemanager.
|      |                     |  58m 31s   | 


             Reason | Tests
 Failed unit tests  |  hadoop.yarn.server.nodemanager.TestNodeStatusUpdaterForLabels 


|| Subsystem || Report/Notes ||
============================================================================
| Patch URL | http://issues.apache.org/jira/secure/attachment/12746561/YARN-1644-YARN-1197.5.patch
|
| Optional Tests | javac unit findbugs checkstyle javadoc |
| git revision | YARN-1197 / 2934ff3 |
| Pre-patch Findbugs warnings | /home/jenkins/jenkins-slave/workspace/PreCommit-YARN-Build/patchprocess/YARN-1197FindbugsWarningshadoop-yarn-server-common.html
|
| checkstyle |  /home/jenkins/jenkins-slave/workspace/PreCommit-YARN-Build/patchprocess/diffcheckstylehadoop-yarn-server-common.txt
|
| hadoop-yarn-client test log | /home/jenkins/jenkins-slave/workspace/PreCommit-YARN-Build/patchprocess/testrun_hadoop-yarn-client.txt
|
| hadoop-yarn-server-common test log | /home/jenkins/jenkins-slave/workspace/PreCommit-YARN-Build/patchprocess/testrun_hadoop-yarn-server-common.txt
|
| hadoop-yarn-server-nodemanager test log | /home/jenkins/jenkins-slave/workspace/PreCommit-YARN-Build/patchprocess/testrun_hadoop-yarn-server-nodemanager.txt
|
| Test Results | https://builds.apache.org/job/PreCommit-YARN-Build/8614/testReport/ |
| Java | 1.7.0_55 |
| uname | Linux asf907.gq1.ygridcore.net 3.13.0-36-lowlatency #63-Ubuntu SMP PREEMPT Wed Sep
3 21:56:12 UTC 2014 x86_64 x86_64 x86_64 GNU/Linux |


============================================================================
============================================================================
                          Adding comment to JIRA
============================================================================
============================================================================


Comment added.
d29748d3b4f9480ff8b26bf280c1fa9448f7764e logged out


============================================================================
============================================================================
                              Finished build.
============================================================================
============================================================================


Build step 'Execute shell' marked build as failure
Archiving artifacts
Sending artifact delta relative to PreCommit-YARN-Build #8600
Archived 56 artifacts
Archive block size is 32768
Received 199 blocks and 6979332 bytes
Compression is 48.3%
Took 1.7 sec
[description-setter] Could not determine description.
Recording test results
Publish JUnit test result report is waiting for a checkpoint on PreCommit-YARN-Build #8612
Email was triggered for: Failure
Sending email for trigger: Failure



###################################################################################
############################## FAILED TESTS (if any) ##############################
1 tests failed.
FAILED:  org.apache.hadoop.yarn.server.nodemanager.TestNodeStatusUpdaterForLabels.testNodeStatusUpdaterForNodeLabels

Error Message:
null

Stack Trace:
java.lang.NullPointerException: null
	at java.util.HashSet.<init>(HashSet.java:116)
	at org.apache.hadoop.yarn.nodelabels.NodeLabelTestBase.assertNLCollectionEquals(NodeLabelTestBase.java:103)
	at org.apache.hadoop.yarn.server.nodemanager.TestNodeStatusUpdaterForLabels.testNodeStatusUpdaterForNodeLabels(TestNodeStatusUpdaterForLabels.java:269)



Mime
  • Unnamed multipart/mixed (inline, None, 0 bytes)
View raw message