hadoop-yarn-dev mailing list archives

Site index · List index
Message view « Date » · « Thread »
Top « Date » · « Thread »
From Apache Jenkins Server <jenk...@builds.apache.org>
Subject Failed: YARN-3045 PreCommit Build #8594
Date Tue, 21 Jul 2015 13:58:47 GMT
Jira: https://issues.apache.org/jira/browse/YARN-3045
Build: https://builds.apache.org/job/PreCommit-YARN-Build/8594/

###################################################################################
########################## LAST 60 LINES OF THE CONSOLE ###########################
[...truncated 369 lines...]
|      |                     |            | new Findbugs (version 3.0.0)
|      |                     |            | warnings.
|  +1  |         yarn tests  |  8m 8s     | Tests passed in 
|      |                     |            | hadoop-yarn-applications-distributeds
|      |                     |            | hell.
|  -1  |         yarn tests  |  6m 6s     | Tests failed in 
|      |                     |            | hadoop-yarn-server-nodemanager.
|      |                     |  53m 7s    | 


             Reason | Tests
 Failed unit tests  |  hadoop.yarn.server.nodemanager.containermanager.logaggregation.TestLogAggregationService

                    |  hadoop.yarn.server.nodemanager.containermanager.localizer.TestResourceLocalizationService

                    |  hadoop.yarn.server.nodemanager.containermanager.container.TestContainer



|| Subsystem || Report/Notes ||
============================================================================
| Patch URL | http://issues.apache.org/jira/secure/attachment/12746328/YARN-3045-YARN-2928.006.patch
|
| Optional Tests | javac unit findbugs checkstyle javadoc |
| git revision | YARN-2928 / eb1932d |
| whitespace | /home/jenkins/jenkins-slave/workspace/PreCommit-YARN-Build/patchprocess/whitespace.txt
|
| hadoop-yarn-applications-distributedshell test log | /home/jenkins/jenkins-slave/workspace/PreCommit-YARN-Build/patchprocess/testrun_hadoop-yarn-applications-distributedshell.txt
|
| hadoop-yarn-server-nodemanager test log | /home/jenkins/jenkins-slave/workspace/PreCommit-YARN-Build/patchprocess/testrun_hadoop-yarn-server-nodemanager.txt
|
| Test Results | https://builds.apache.org/job/PreCommit-YARN-Build/8594/testReport/ |
| Java | 1.7.0_55 |
| uname | Linux asf905.gq1.ygridcore.net 3.13.0-36-lowlatency #63-Ubuntu SMP PREEMPT Wed Sep
3 21:56:12 UTC 2014 x86_64 x86_64 x86_64 GNU/Linux |


============================================================================
============================================================================
                          Adding comment to JIRA
============================================================================
============================================================================


Comment added.
e8431b81ec7f03d336eff921402b688b6b8e150f logged out


============================================================================
============================================================================
                              Finished build.
============================================================================
============================================================================


Build step 'Execute shell' marked build as failure
Archiving artifacts
Sending artifact delta relative to PreCommit-YARN-Build #8582
Archived 39 artifacts
Archive block size is 32768
Received 159 blocks and 4861061 bytes
Compression is 51.7%
Took 1.3 sec
[description-setter] Could not determine description.
Recording test results
Email was triggered for: Failure
Sending email for trigger: Failure



###################################################################################
############################## FAILED TESTS (if any) ##############################
4 tests failed.
FAILED:  org.apache.hadoop.yarn.server.nodemanager.containermanager.container.TestContainer.testKillOnLocalizedWhenContainerNotLaunched

Error Message:
expected:<CONTAINER_CLEANEDUP_AFTER_KILL> but was:<KILLING>

Stack Trace:
java.lang.AssertionError: expected:<CONTAINER_CLEANEDUP_AFTER_KILL> but was:<KILLING>
	at org.junit.Assert.fail(Assert.java:88)
	at org.junit.Assert.failNotEquals(Assert.java:743)
	at org.junit.Assert.assertEquals(Assert.java:118)
	at org.junit.Assert.assertEquals(Assert.java:144)
	at org.apache.hadoop.yarn.server.nodemanager.containermanager.container.TestContainer.testKillOnLocalizedWhenContainerNotLaunched(TestContainer.java:413)


FAILED:  org.apache.hadoop.yarn.server.nodemanager.containermanager.localizer.TestResourceLocalizationService.testLocalizationHeartbeat

Error Message:

Wanted but not invoked:
eventHandler.handle(
    <custom argument matcher>
);
-> at org.apache.hadoop.yarn.server.nodemanager.containermanager.localizer.TestResourceLocalizationService.testLocalizationHeartbeat(TestResourceLocalizationService.java:900)
Actually, there were zero interactions with this mock.


Stack Trace:
org.mockito.exceptions.verification.WantedButNotInvoked: 
Wanted but not invoked:
eventHandler.handle(
    <custom argument matcher>
);
-> at org.apache.hadoop.yarn.server.nodemanager.containermanager.localizer.TestResourceLocalizationService.testLocalizationHeartbeat(TestResourceLocalizationService.java:900)
Actually, there were zero interactions with this mock.

	at org.apache.hadoop.yarn.server.nodemanager.containermanager.localizer.TestResourceLocalizationService.testLocalizationHeartbeat(TestResourceLocalizationService.java:900)


FAILED:  org.apache.hadoop.yarn.server.nodemanager.containermanager.localizer.TestResourceLocalizationService.testPublicResourceAddResourceExceptions

Error Message:
expected null, but was:<{ { file:/local/PRIVATE/ef9783a7514fda92, 2411, FILE, null },pending,[(container_314159265358979_0003_01_000042)],2661055154305048,DOWNLOADING}>

Stack Trace:
java.lang.AssertionError: expected null, but was:<{ { file:/local/PRIVATE/ef9783a7514fda92,
2411, FILE, null },pending,[(container_314159265358979_0003_01_000042)],2661055154305048,DOWNLOADING}>
	at org.junit.Assert.fail(Assert.java:88)
	at org.junit.Assert.failNotNull(Assert.java:664)
	at org.junit.Assert.assertNull(Assert.java:646)
	at org.junit.Assert.assertNull(Assert.java:656)
	at org.apache.hadoop.yarn.server.nodemanager.containermanager.localizer.TestResourceLocalizationService.testPublicResourceAddResourceExceptions(TestResourceLocalizationService.java:1366)


FAILED:  org.apache.hadoop.yarn.server.nodemanager.containermanager.logaggregation.TestLogAggregationService.testLogAggregationCreateDirsFailsWithoutKillingNM

Error Message:
Multiple exceptions

Stack Trace:
org.mortbay.util.MultiException: Multiple exceptions
	at org.apache.hadoop.yarn.server.nodemanager.containermanager.logaggregation.TestLogAggregationService.checkEvents(TestLogAggregationService.java:1046)
	at org.apache.hadoop.yarn.server.nodemanager.containermanager.logaggregation.TestLogAggregationService.testLogAggregationCreateDirsFailsWithoutKillingNM(TestLogAggregationService.java:736)



Mime
  • Unnamed multipart/mixed (inline, None, 0 bytes)
View raw message