hadoop-yarn-dev mailing list archives

Site index · List index
Message view « Date » · « Thread »
Top « Date » · « Thread »
From Apache Jenkins Server <jenk...@builds.apache.org>
Subject Hadoop-Yarn-trunk-Java8 - Build # 255 - Still Failing
Date Mon, 13 Jul 2015 10:43:47 GMT
See https://builds.apache.org/job/Hadoop-Yarn-trunk-Java8/255/

###################################################################################
########################## LAST 60 LINES OF THE CONSOLE ###########################
[...truncated 4475 lines...]

Tests in error: 
  TestLogAggregationService.testLogAggregationInitAppFailsWithoutKillingNM:690->checkEvents:1046
Multi
  TestLogAggregationService.testLogAggregationCreateDirsFailsWithoutKillingNM:736->checkEvents:1046
Multi
  TestLogAggregationService.testVerifyAndCreateRemoteDirsFailure:542->checkEvents:1046
Multi

Tests run: 323, Failures: 3, Errors: 3, Skipped: 17

[INFO] ------------------------------------------------------------------------
[INFO] Reactor Summary:
[INFO] 
[INFO] Apache Hadoop YARN ................................ SUCCESS [  3.024 s]
[INFO] Apache Hadoop YARN API ............................ SUCCESS [01:12 min]
[INFO] Apache Hadoop YARN Common ......................... SUCCESS [02:25 min]
[INFO] Apache Hadoop YARN Server ......................... SUCCESS [  0.062 s]
[INFO] Apache Hadoop YARN Server Common .................. SUCCESS [ 36.343 s]
[INFO] Apache Hadoop YARN NodeManager .................... FAILURE [05:49 min]
[INFO] Apache Hadoop YARN Web Proxy ...................... SKIPPED
[INFO] Apache Hadoop YARN ApplicationHistoryService ...... SKIPPED
[INFO] Apache Hadoop YARN ResourceManager ................ SKIPPED
[INFO] Apache Hadoop YARN Server Tests ................... SKIPPED
[INFO] Apache Hadoop YARN Client ......................... SKIPPED
[INFO] Apache Hadoop YARN SharedCacheManager ............. SKIPPED
[INFO] Apache Hadoop YARN Applications ................... SKIPPED
[INFO] Apache Hadoop YARN DistributedShell ............... SKIPPED
[INFO] Apache Hadoop YARN Unmanaged Am Launcher .......... SKIPPED
[INFO] Apache Hadoop YARN Site ........................... SKIPPED
[INFO] Apache Hadoop YARN Registry ....................... SKIPPED
[INFO] Apache Hadoop YARN Project ........................ SKIPPED
[INFO] ------------------------------------------------------------------------
[INFO] BUILD FAILURE
[INFO] ------------------------------------------------------------------------
[INFO] Total time: 10:07 min
[INFO] Finished at: 2015-07-13T10:43:53+00:00
[INFO] Final Memory: 80M/1063M
[INFO] ------------------------------------------------------------------------
[ERROR] Failed to execute goal org.apache.maven.plugins:maven-surefire-plugin:2.17:test (default-test)
on project hadoop-yarn-server-nodemanager: There are test failures.
[ERROR] 
[ERROR] Please refer to /home/jenkins/jenkins-slave/workspace/Hadoop-Yarn-trunk-Java8/hadoop-yarn-project/hadoop-yarn/hadoop-yarn-server/hadoop-yarn-server-nodemanager/target/surefire-reports
for the individual test results.
[ERROR] -> [Help 1]
[ERROR] 
[ERROR] To see the full stack trace of the errors, re-run Maven with the -e switch.
[ERROR] Re-run Maven using the -X switch to enable full debug logging.
[ERROR] 
[ERROR] For more information about the errors and possible solutions, please read the following
articles:
[ERROR] [Help 1] http://cwiki.apache.org/confluence/display/MAVEN/MojoFailureException
[ERROR] 
[ERROR] After correcting the problems, you can resume the build with the command
[ERROR]   mvn <goals> -rf :hadoop-yarn-server-nodemanager
Build step 'Execute shell' marked build as failure
Archiving artifacts
Recording test results
Updating YARN-3069
Updating MAPREDUCE-6421
Updating YARN-3894
Updating YARN-3381
Sending e-mails to: yarn-dev@hadoop.apache.org
Email was triggered for: Failure
Sending email for trigger: Failure



###################################################################################
############################## FAILED TESTS (if any) ##############################
6 tests failed.
REGRESSION:  org.apache.hadoop.yarn.server.nodemanager.containermanager.logaggregation.TestLogAggregationService.testVerifyAndCreateRemoteDirsFailure

Error Message:
Multiple exceptions

Stack Trace:
org.mortbay.util.MultiException: Multiple exceptions
	at org.apache.hadoop.yarn.server.nodemanager.containermanager.logaggregation.TestLogAggregationService.checkEvents(TestLogAggregationService.java:1046)
	at org.apache.hadoop.yarn.server.nodemanager.containermanager.logaggregation.TestLogAggregationService.testVerifyAndCreateRemoteDirsFailure(TestLogAggregationService.java:542)


FAILED:  org.apache.hadoop.yarn.server.nodemanager.containermanager.container.TestContainer.testKillOnLocalizedWhenContainerNotLaunched

Error Message:
expected:<CONTAINER_CLEANEDUP_AFTER_KILL> but was:<KILLING>

Stack Trace:
java.lang.AssertionError: expected:<CONTAINER_CLEANEDUP_AFTER_KILL> but was:<KILLING>
	at org.junit.Assert.fail(Assert.java:88)
	at org.junit.Assert.failNotEquals(Assert.java:743)
	at org.junit.Assert.assertEquals(Assert.java:118)
	at org.junit.Assert.assertEquals(Assert.java:144)
	at org.apache.hadoop.yarn.server.nodemanager.containermanager.container.TestContainer.testKillOnLocalizedWhenContainerNotLaunched(TestContainer.java:412)


FAILED:  org.apache.hadoop.yarn.server.nodemanager.containermanager.localizer.TestResourceLocalizationService.testLocalizationHeartbeat

Error Message:

Wanted but not invoked:
eventHandler.handle(
    <custom argument matcher>
);
-> at org.apache.hadoop.yarn.server.nodemanager.containermanager.localizer.TestResourceLocalizationService.testLocalizationHeartbeat(TestResourceLocalizationService.java:900)
Actually, there were zero interactions with this mock.


Stack Trace:
org.mockito.exceptions.verification.WantedButNotInvoked: 
Wanted but not invoked:
eventHandler.handle(
    <custom argument matcher>
);
-> at org.apache.hadoop.yarn.server.nodemanager.containermanager.localizer.TestResourceLocalizationService.testLocalizationHeartbeat(TestResourceLocalizationService.java:900)
Actually, there were zero interactions with this mock.

	at org.apache.hadoop.yarn.server.nodemanager.containermanager.localizer.TestResourceLocalizationService.testLocalizationHeartbeat(TestResourceLocalizationService.java:900)


FAILED:  org.apache.hadoop.yarn.server.nodemanager.containermanager.localizer.TestResourceLocalizationService.testPublicResourceAddResourceExceptions

Error Message:
expected null, but was:<{ { file:/local/PRIVATE/5bd33d1361e40ec6, 3061, FILE, null },pending,[(container_314159265358979_0003_01_000042)],1958150365821287,DOWNLOADING}>

Stack Trace:
java.lang.AssertionError: expected null, but was:<{ { file:/local/PRIVATE/5bd33d1361e40ec6,
3061, FILE, null },pending,[(container_314159265358979_0003_01_000042)],1958150365821287,DOWNLOADING}>
	at org.junit.Assert.fail(Assert.java:88)
	at org.junit.Assert.failNotNull(Assert.java:664)
	at org.junit.Assert.assertNull(Assert.java:646)
	at org.junit.Assert.assertNull(Assert.java:656)
	at org.apache.hadoop.yarn.server.nodemanager.containermanager.localizer.TestResourceLocalizationService.testPublicResourceAddResourceExceptions(TestResourceLocalizationService.java:1366)


FAILED:  org.apache.hadoop.yarn.server.nodemanager.containermanager.logaggregation.TestLogAggregationService.testLogAggregationInitAppFailsWithoutKillingNM

Error Message:
Multiple exceptions

Stack Trace:
org.mortbay.util.MultiException: Multiple exceptions
	at org.apache.hadoop.yarn.server.nodemanager.containermanager.logaggregation.TestLogAggregationService.checkEvents(TestLogAggregationService.java:1046)
	at org.apache.hadoop.yarn.server.nodemanager.containermanager.logaggregation.TestLogAggregationService.testLogAggregationInitAppFailsWithoutKillingNM(TestLogAggregationService.java:690)


FAILED:  org.apache.hadoop.yarn.server.nodemanager.containermanager.logaggregation.TestLogAggregationService.testLogAggregationCreateDirsFailsWithoutKillingNM

Error Message:
Multiple exceptions

Stack Trace:
org.mortbay.util.MultiException: Multiple exceptions
	at org.apache.hadoop.yarn.server.nodemanager.containermanager.logaggregation.TestLogAggregationService.checkEvents(TestLogAggregationService.java:1046)
	at org.apache.hadoop.yarn.server.nodemanager.containermanager.logaggregation.TestLogAggregationService.testLogAggregationCreateDirsFailsWithoutKillingNM(TestLogAggregationService.java:736)



Mime
  • Unnamed multipart/mixed (inline, None, 0 bytes)
View raw message