hadoop-yarn-dev mailing list archives

Site index · List index
Message view « Date » · « Thread »
Top « Date » · « Thread »
From Apache Jenkins Server <jenk...@builds.apache.org>
Subject Failed: YARN-1645 PreCommit Build #8577
Date Fri, 17 Jul 2015 22:25:56 GMT
Jira: https://issues.apache.org/jira/browse/YARN-1645
Build: https://builds.apache.org/job/PreCommit-YARN-Build/8577/

###################################################################################
########################## LAST 60 LINES OF THE CONSOLE ###########################
[...truncated 321 lines...]
|      |                     |            | issues.
|  +1  |         whitespace  |  0m 9s     | The patch has no lines that end in 
|      |                     |            | whitespace.
|  +1  |            install  |  1m 21s    | mvn install still works. 
|  +1  |    eclipse:eclipse  |  0m 34s    | The patch built with 
|      |                     |            | eclipse:eclipse.
|  +1  |           findbugs  |  1m 12s    | The patch does not introduce any 
|      |                     |            | new Findbugs (version 3.0.0)
|      |                     |            | warnings.
|  -1  |         yarn tests  |  6m 19s    | Tests failed in 
|      |                     |            | hadoop-yarn-server-nodemanager.
|      |                     |  42m 50s   | 


             Reason | Tests
 Failed unit tests  |  hadoop.yarn.server.nodemanager.containermanager.TestContainerManager



|| Subsystem || Report/Notes ||
============================================================================
| Patch URL | http://issues.apache.org/jira/secure/attachment/12745884/YARN-1645-YARN-1197.4.patch
|
| Optional Tests | javadoc javac unit findbugs checkstyle |
| git revision | YARN-1197 / 8041fd8 |
| hadoop-yarn-server-nodemanager test log | /home/jenkins/jenkins-slave/workspace/PreCommit-YARN-Build/patchprocess/testrun_hadoop-yarn-server-nodemanager.txt
|
| Test Results | https://builds.apache.org/job/PreCommit-YARN-Build/8577/testReport/ |
| Java | 1.7.0_55 |
| uname | Linux asf902.gq1.ygridcore.net 3.13.0-36-lowlatency #63-Ubuntu SMP PREEMPT Wed Sep
3 21:56:12 UTC 2014 x86_64 x86_64 x86_64 GNU/Linux |


============================================================================
============================================================================
                          Adding comment to JIRA
============================================================================
============================================================================


Comment added.
24c562bb8919aa039c0fc10a4eb6bbaf448849c2 logged out


============================================================================
============================================================================
                              Finished build.
============================================================================
============================================================================


Build step 'Execute shell' marked build as failure
Archiving artifacts
Sending artifact delta relative to PreCommit-YARN-Build #8558
Archived 27 artifacts
Archive block size is 32768
Received 39 blocks and 8358858 bytes
Compression is 13.3%
Took 2.5 sec
[description-setter] Could not determine description.
Recording test results
Email was triggered for: Failure
Sending email for trigger: Failure



###################################################################################
############################## FAILED TESTS (if any) ##############################
1 tests failed.
FAILED:  org.apache.hadoop.yarn.server.nodemanager.containermanager.TestContainerManager.testIncreaseContainerResourceWithInvalidRequests

Error Message:
expected:<0> but was:<1>

Stack Trace:
java.lang.AssertionError: expected:<0> but was:<1>
	at org.junit.Assert.fail(Assert.java:88)
	at org.junit.Assert.failNotEquals(Assert.java:743)
	at org.junit.Assert.assertEquals(Assert.java:118)
	at org.junit.Assert.assertEquals(Assert.java:555)
	at org.junit.Assert.assertEquals(Assert.java:542)
	at org.apache.hadoop.yarn.server.nodemanager.containermanager.TestContainerManager.testIncreaseContainerResourceWithInvalidRequests(TestContainerManager.java:944)



Mime
  • Unnamed multipart/mixed (inline, None, 0 bytes)
View raw message