hadoop-yarn-dev mailing list archives

Site index · List index
Message view « Date » · « Thread »
Top « Date » · « Thread »
From Apache Jenkins Server <jenk...@builds.apache.org>
Subject Failed: YARN-3534 PreCommit Build #8488
Date Fri, 10 Jul 2015 02:25:51 GMT
Jira: https://issues.apache.org/jira/browse/YARN-3534
Build: https://builds.apache.org/job/PreCommit-YARN-Build/8488/

###################################################################################
########################## LAST 60 LINES OF THE CONSOLE ###########################
[...truncated 318 lines...]
|      |                     |            | new Findbugs (version 3.0.0)
|      |                     |            | warnings.
|  +1  |         yarn tests  |  0m 25s    | Tests passed in hadoop-yarn-api. 
|  -1  |         yarn tests  |  6m 6s     | Tests failed in 
|      |                     |            | hadoop-yarn-server-nodemanager.
|      |                     |  48m 0s    | 


             Reason | Tests
 Failed unit tests  |  hadoop.yarn.server.nodemanager.containermanager.logaggregation.TestLogAggregationService

                    |  hadoop.yarn.server.nodemanager.containermanager.localizer.TestResourceLocalizationService

                    |  hadoop.yarn.server.nodemanager.containermanager.container.TestContainer

                    |  hadoop.yarn.server.nodemanager.TestDeletionService 


|| Subsystem || Report/Notes ||
============================================================================
| Patch URL | http://issues.apache.org/jira/secure/attachment/12744609/YARN-3534-15.patch
|
| Optional Tests | javadoc javac unit findbugs checkstyle |
| git revision | trunk / 1a0752d |
| javac | /home/jenkins/jenkins-slave/workspace/PreCommit-YARN-Build/patchprocess/diffJavacWarnings.txt
|
| checkstyle |  /home/jenkins/jenkins-slave/workspace/PreCommit-YARN-Build/patchprocess/diffcheckstylehadoop-yarn-api.txt
|
| hadoop-yarn-api test log | /home/jenkins/jenkins-slave/workspace/PreCommit-YARN-Build/patchprocess/testrun_hadoop-yarn-api.txt
|
| hadoop-yarn-server-nodemanager test log | /home/jenkins/jenkins-slave/workspace/PreCommit-YARN-Build/patchprocess/testrun_hadoop-yarn-server-nodemanager.txt
|
| Test Results | https://builds.apache.org/job/PreCommit-YARN-Build/8488/testReport/ |
| Java | 1.7.0_55 |
| uname | Linux asf902.gq1.ygridcore.net 3.13.0-36-lowlatency #63-Ubuntu SMP PREEMPT Wed Sep
3 21:56:12 UTC 2014 x86_64 x86_64 x86_64 GNU/Linux |


============================================================================
============================================================================
                          Adding comment to JIRA
============================================================================
============================================================================


Comment added.
f7c73accf261d3f422ab8c1fe8365f69550c7502 logged out


============================================================================
============================================================================
                              Finished build.
============================================================================
============================================================================


Build step 'Execute shell' marked build as failure
Archiving artifacts
Sending artifact delta relative to PreCommit-YARN-Build #8480
Archived 45 artifacts
Archive block size is 32768
Received 33 blocks and 28106853 bytes
Compression is 3.7%
Took 5.7 sec
[description-setter] Could not determine description.
Recording test results
Email was triggered for: Failure
Sending email for trigger: Failure



###################################################################################
############################## FAILED TESTS (if any) ##############################
7 tests failed.
REGRESSION:  org.apache.hadoop.yarn.server.nodemanager.TestDeletionService.testAbsDelete

Error Message:
/home/jenkins/jenkins-slave/workspace/PreCommit-YARN-Build/hadoop-yarn-project/hadoop-yarn/hadoop-yarn-server/hadoop-yarn-server-nodemanager/target/org.apache.hadoop.yarn.server.nodemanager.TestDeletionService/7341540552424201612/6139435647770529838/982894776092726544/3390784565061496270

Stack Trace:
java.nio.file.NoSuchFileException: /home/jenkins/jenkins-slave/workspace/PreCommit-YARN-Build/hadoop-yarn-project/hadoop-yarn/hadoop-yarn-server/hadoop-yarn-server-nodemanager/target/org.apache.hadoop.yarn.server.nodemanager.TestDeletionService/7341540552424201612/6139435647770529838/982894776092726544/3390784565061496270
	at sun.nio.fs.UnixException.translateToIOException(UnixException.java:86)
	at sun.nio.fs.UnixException.rethrowAsIOException(UnixException.java:102)
	at sun.nio.fs.UnixException.rethrowAsIOException(UnixException.java:107)
	at sun.nio.fs.UnixFileAttributeViews$Basic.readAttributes(UnixFileAttributeViews.java:55)
	at sun.nio.fs.UnixFileSystemProvider.readAttributes(UnixFileSystemProvider.java:144)
	at sun.nio.fs.LinuxFileSystemProvider.readAttributes(LinuxFileSystemProvider.java:97)
	at java.nio.file.Files.readAttributes(Files.java:1684)
	at org.apache.hadoop.fs.RawLocalFileSystem$DeprecatedRawLocalFileStatus.<init>(RawLocalFileSystem.java:653)
	at org.apache.hadoop.fs.RawLocalFileSystem.deprecatedGetFileStatus(RawLocalFileSystem.java:634)
	at org.apache.hadoop.fs.RawLocalFileSystem.getFileLinkStatusInternal(RawLocalFileSystem.java:850)
	at org.apache.hadoop.fs.RawLocalFileSystem.getFileStatus(RawLocalFileSystem.java:627)
	at org.apache.hadoop.fs.DelegateToFileSystem.getFileStatus(DelegateToFileSystem.java:110)
	at org.apache.hadoop.fs.FilterFs.getFileStatus(FilterFs.java:121)
	at org.apache.hadoop.fs.FileContext$15.next(FileContext.java:1163)
	at org.apache.hadoop.fs.FileContext$15.next(FileContext.java:1159)
	at org.apache.hadoop.fs.FSLinkResolver.resolve(FSLinkResolver.java:90)
	at org.apache.hadoop.fs.FileContext.getFileStatus(FileContext.java:1159)
	at org.apache.hadoop.fs.FileContext$Util.exists(FileContext.java:1624)
	at org.apache.hadoop.yarn.server.nodemanager.TestDeletionService.testAbsDelete(TestDeletionService.java:132)


REGRESSION:  org.apache.hadoop.yarn.server.nodemanager.containermanager.logaggregation.TestLogAggregationService.testLogAggregationInitAppFailsWithoutKillingNM

Error Message:
Multiple exceptions

Stack Trace:
org.mortbay.util.MultiException: Multiple exceptions
	at org.apache.hadoop.yarn.server.nodemanager.containermanager.logaggregation.TestLogAggregationService.checkEvents(TestLogAggregationService.java:1046)
	at org.apache.hadoop.yarn.server.nodemanager.containermanager.logaggregation.TestLogAggregationService.testLogAggregationInitAppFailsWithoutKillingNM(TestLogAggregationService.java:690)


REGRESSION:  org.apache.hadoop.yarn.server.nodemanager.containermanager.logaggregation.TestLogAggregationService.testLogAggregationCreateDirsFailsWithoutKillingNM

Error Message:
Multiple exceptions

Stack Trace:
org.mortbay.util.MultiException: Multiple exceptions
	at org.apache.hadoop.yarn.server.nodemanager.containermanager.logaggregation.TestLogAggregationService.checkEvents(TestLogAggregationService.java:1046)
	at org.apache.hadoop.yarn.server.nodemanager.containermanager.logaggregation.TestLogAggregationService.testLogAggregationCreateDirsFailsWithoutKillingNM(TestLogAggregationService.java:736)


FAILED:  org.apache.hadoop.yarn.server.nodemanager.containermanager.logaggregation.TestLogAggregationService.testVerifyAndCreateRemoteDirsFailure

Error Message:
Multiple exceptions

Stack Trace:
org.mortbay.util.MultiException: Multiple exceptions
	at org.apache.hadoop.yarn.server.nodemanager.containermanager.logaggregation.TestLogAggregationService.checkEvents(TestLogAggregationService.java:1046)
	at org.apache.hadoop.yarn.server.nodemanager.containermanager.logaggregation.TestLogAggregationService.testVerifyAndCreateRemoteDirsFailure(TestLogAggregationService.java:542)


FAILED:  org.apache.hadoop.yarn.server.nodemanager.containermanager.container.TestContainer.testKillOnLocalizedWhenContainerNotLaunched

Error Message:
expected:<CONTAINER_CLEANEDUP_AFTER_KILL> but was:<KILLING>

Stack Trace:
java.lang.AssertionError: expected:<CONTAINER_CLEANEDUP_AFTER_KILL> but was:<KILLING>
	at org.junit.Assert.fail(Assert.java:88)
	at org.junit.Assert.failNotEquals(Assert.java:743)
	at org.junit.Assert.assertEquals(Assert.java:118)
	at org.junit.Assert.assertEquals(Assert.java:144)
	at org.apache.hadoop.yarn.server.nodemanager.containermanager.container.TestContainer.testKillOnLocalizedWhenContainerNotLaunched(TestContainer.java:412)


FAILED:  org.apache.hadoop.yarn.server.nodemanager.containermanager.localizer.TestResourceLocalizationService.testLocalizationHeartbeat

Error Message:

Wanted but not invoked:
eventHandler.handle(
    <custom argument matcher>
);
-> at org.apache.hadoop.yarn.server.nodemanager.containermanager.localizer.TestResourceLocalizationService.testLocalizationHeartbeat(TestResourceLocalizationService.java:900)
Actually, there were zero interactions with this mock.


Stack Trace:
org.mockito.exceptions.verification.WantedButNotInvoked: 
Wanted but not invoked:
eventHandler.handle(
    <custom argument matcher>
);
-> at org.apache.hadoop.yarn.server.nodemanager.containermanager.localizer.TestResourceLocalizationService.testLocalizationHeartbeat(TestResourceLocalizationService.java:900)
Actually, there were zero interactions with this mock.

	at org.apache.hadoop.yarn.server.nodemanager.containermanager.localizer.TestResourceLocalizationService.testLocalizationHeartbeat(TestResourceLocalizationService.java:900)


FAILED:  org.apache.hadoop.yarn.server.nodemanager.containermanager.localizer.TestResourceLocalizationService.testPublicResourceAddResourceExceptions

Error Message:
expected null, but was:<{ { file:/local/PRIVATE/d401b58330dba622, 2222, FILE, null },pending,[(container_314159265358979_0003_01_000042)],7053369823099829,DOWNLOADING}>

Stack Trace:
java.lang.AssertionError: expected null, but was:<{ { file:/local/PRIVATE/d401b58330dba622,
2222, FILE, null },pending,[(container_314159265358979_0003_01_000042)],7053369823099829,DOWNLOADING}>
	at org.junit.Assert.fail(Assert.java:88)
	at org.junit.Assert.failNotNull(Assert.java:664)
	at org.junit.Assert.assertNull(Assert.java:646)
	at org.junit.Assert.assertNull(Assert.java:656)
	at org.apache.hadoop.yarn.server.nodemanager.containermanager.localizer.TestResourceLocalizationService.testPublicResourceAddResourceExceptions(TestResourceLocalizationService.java:1366)



Mime
  • Unnamed multipart/mixed (inline, None, 0 bytes)
View raw message