hadoop-yarn-dev mailing list archives

Site index · List index
Message view « Date » · « Thread »
Top « Date » · « Thread »
From Apache Jenkins Server <jenk...@builds.apache.org>
Subject Hadoop-Yarn-trunk-Java8 - Build # 272 - Failure
Date Thu, 30 Jul 2015 11:38:44 GMT
See https://builds.apache.org/job/Hadoop-Yarn-trunk-Java8/272/

###################################################################################
########################## LAST 60 LINES OF THE CONSOLE ###########################
[...truncated 5553 lines...]
  TestRMWebServicesApps.testMultipleAppAttempts:1413 » NullPointer
  TestRMWebServicesApps.testAppsQueryFinishEnd:734 » NullPointer
  TestRMWebServicesApps.testAppsQueryAppTypes:802 » NullPointer
  TestRMWebServicesApps.testAppsQueryFinishBeginEnd:768 » NullPointer

Tests run: 1145, Failures: 0, Errors: 11, Skipped: 1

[INFO] ------------------------------------------------------------------------
[INFO] Reactor Summary:
[INFO] 
[INFO] Apache Hadoop YARN ................................ SUCCESS [  4.233 s]
[INFO] Apache Hadoop YARN API ............................ SUCCESS [01:15 min]
[INFO] Apache Hadoop YARN Common ......................... SUCCESS [02:18 min]
[INFO] Apache Hadoop YARN Server ......................... SUCCESS [  0.064 s]
[INFO] Apache Hadoop YARN Server Common .................. SUCCESS [ 35.980 s]
[INFO] Apache Hadoop YARN NodeManager .................... SUCCESS [06:38 min]
[INFO] Apache Hadoop YARN Web Proxy ...................... SUCCESS [ 16.539 s]
[INFO] Apache Hadoop YARN ApplicationHistoryService ...... SUCCESS [03:08 min]
[INFO] Apache Hadoop YARN ResourceManager ................ FAILURE [51:35 min]
[INFO] Apache Hadoop YARN Server Tests ................... SKIPPED
[INFO] Apache Hadoop YARN Client ......................... SKIPPED
[INFO] Apache Hadoop YARN SharedCacheManager ............. SKIPPED
[INFO] Apache Hadoop YARN Applications ................... SKIPPED
[INFO] Apache Hadoop YARN DistributedShell ............... SKIPPED
[INFO] Apache Hadoop YARN Unmanaged Am Launcher .......... SKIPPED
[INFO] Apache Hadoop YARN Site ........................... SKIPPED
[INFO] Apache Hadoop YARN Registry ....................... SKIPPED
[INFO] Apache Hadoop YARN Project ........................ SKIPPED
[INFO] ------------------------------------------------------------------------
[INFO] BUILD FAILURE
[INFO] ------------------------------------------------------------------------
[INFO] Total time: 01:05 h
[INFO] Finished at: 2015-07-30T11:39:07+00:00
[INFO] Final Memory: 61M/1037M
[INFO] ------------------------------------------------------------------------
[ERROR] Failed to execute goal org.apache.maven.plugins:maven-surefire-plugin:2.17:test (default-test)
on project hadoop-yarn-server-resourcemanager: There are test failures.
[ERROR] 
[ERROR] Please refer to /home/jenkins/jenkins-slave/workspace/Hadoop-Yarn-trunk-Java8/hadoop-yarn-project/hadoop-yarn/hadoop-yarn-server/hadoop-yarn-server-resourcemanager/target/surefire-reports
for the individual test results.
[ERROR] -> [Help 1]
[ERROR] 
[ERROR] To see the full stack trace of the errors, re-run Maven with the -e switch.
[ERROR] Re-run Maven using the -X switch to enable full debug logging.
[ERROR] 
[ERROR] For more information about the errors and possible solutions, please read the following
articles:
[ERROR] [Help 1] http://cwiki.apache.org/confluence/display/MAVEN/MojoFailureException
[ERROR] 
[ERROR] After correcting the problems, you can resume the build with the command
[ERROR]   mvn <goals> -rf :hadoop-yarn-server-resourcemanager
Build step 'Execute shell' marked build as failure
Archiving artifacts
Recording test results
Updating YARN-2768
Updating HDFS-8816
Updating YARN-3950
Updating HADOOP-10945
Updating YARN-3919
Sending e-mails to: yarn-dev@hadoop.apache.org
Email was triggered for: Failure
Sending email for trigger: Failure



###################################################################################
############################## FAILED TESTS (if any) ##############################
11 tests failed.
REGRESSION:  org.apache.hadoop.yarn.server.resourcemanager.webapp.TestNodesPage.testNodesBlockRenderForNodeLabelFilterWithEmptyLabel

Error Message:
org/apache/hadoop/metrics2/MetricsSource

Stack Trace:
java.lang.NoClassDefFoundError: org/apache/hadoop/metrics2/MetricsSource
	at java.net.URLClassLoader$1.run(URLClassLoader.java:372)
	at java.net.URLClassLoader$1.run(URLClassLoader.java:361)
	at java.security.AccessController.doPrivileged(Native Method)
	at java.net.URLClassLoader.findClass(URLClassLoader.java:360)
	at java.lang.ClassLoader.loadClass(ClassLoader.java:424)
	at sun.misc.Launcher$AppClassLoader.loadClass(Launcher.java:308)
	at java.lang.ClassLoader.loadClass(ClassLoader.java:357)
	at java.lang.ClassLoader.defineClass1(Native Method)
	at java.lang.ClassLoader.defineClass(ClassLoader.java:760)
	at java.security.SecureClassLoader.defineClass(SecureClassLoader.java:142)
	at java.net.URLClassLoader.defineClass(URLClassLoader.java:455)
	at java.net.URLClassLoader.access$100(URLClassLoader.java:73)
	at java.net.URLClassLoader$1.run(URLClassLoader.java:367)
	at java.net.URLClassLoader$1.run(URLClassLoader.java:361)
	at java.security.AccessController.doPrivileged(Native Method)
	at java.net.URLClassLoader.findClass(URLClassLoader.java:360)
	at java.lang.ClassLoader.loadClass(ClassLoader.java:424)
	at sun.misc.Launcher$AppClassLoader.loadClass(Launcher.java:308)
	at java.lang.ClassLoader.loadClass(ClassLoader.java:357)
	at org.apache.hadoop.yarn.server.resourcemanager.scheduler.capacity.CapacityScheduler.parseQueue(CapacityScheduler.java:635)
	at org.apache.hadoop.yarn.server.resourcemanager.scheduler.capacity.CapacityScheduler.initializeQueues(CapacityScheduler.java:499)
	at org.apache.hadoop.yarn.server.resourcemanager.scheduler.capacity.CapacityScheduler.initScheduler(CapacityScheduler.java:325)
	at org.apache.hadoop.yarn.server.resourcemanager.scheduler.capacity.CapacityScheduler.serviceInit(CapacityScheduler.java:358)
	at org.apache.hadoop.service.AbstractService.init(AbstractService.java:163)
	at org.apache.hadoop.yarn.server.resourcemanager.webapp.TestRMWebApp.mockCapacityScheduler(TestRMWebApp.java:233)
	at org.apache.hadoop.yarn.server.resourcemanager.webapp.TestRMWebApp.mockRm(TestRMWebApp.java:210)
	at org.apache.hadoop.yarn.server.resourcemanager.webapp.TestNodesPage$1.configure(TestNodesPage.java:68)
	at com.google.inject.spi.Elements$RecordingBinder.install(Elements.java:223)
	at com.google.inject.AbstractModule.install(AbstractModule.java:118)
	at org.apache.hadoop.yarn.webapp.test.WebAppTests$1.configure(WebAppTests.java:72)
	at com.google.inject.AbstractModule.configure(AbstractModule.java:59)
	at com.google.inject.spi.Elements$RecordingBinder.install(Elements.java:223)
	at com.google.inject.spi.Elements.getElements(Elements.java:101)
	at com.google.inject.internal.InjectorShell$Builder.build(InjectorShell.java:133)
	at com.google.inject.internal.InternalInjectorCreator.build(InternalInjectorCreator.java:103)
	at com.google.inject.Guice.createInjector(Guice.java:95)
	at com.google.inject.Guice.createInjector(Guice.java:72)
	at com.google.inject.Guice.createInjector(Guice.java:62)
	at org.apache.hadoop.yarn.webapp.test.WebAppTests.createMockInjector(WebAppTests.java:59)
	at org.apache.hadoop.yarn.server.resourcemanager.webapp.TestNodesPage.setUp(TestNodesPage.java:62)


REGRESSION:  org.apache.hadoop.yarn.server.resourcemanager.webapp.TestNodesPage.testNodesBlockRenderForNodeLabelFilterWithNonEmptyLabel

Error Message:
org/apache/hadoop/metrics2/MetricsSource

Stack Trace:
java.lang.NoClassDefFoundError: org/apache/hadoop/metrics2/MetricsSource
	at java.net.URLClassLoader$1.run(URLClassLoader.java:372)
	at java.net.URLClassLoader$1.run(URLClassLoader.java:361)
	at java.security.AccessController.doPrivileged(Native Method)
	at java.net.URLClassLoader.findClass(URLClassLoader.java:360)
	at java.lang.ClassLoader.loadClass(ClassLoader.java:424)
	at sun.misc.Launcher$AppClassLoader.loadClass(Launcher.java:308)
	at java.lang.ClassLoader.loadClass(ClassLoader.java:357)
	at java.lang.ClassLoader.defineClass1(Native Method)
	at java.lang.ClassLoader.defineClass(ClassLoader.java:760)
	at java.security.SecureClassLoader.defineClass(SecureClassLoader.java:142)
	at java.net.URLClassLoader.defineClass(URLClassLoader.java:455)
	at java.net.URLClassLoader.access$100(URLClassLoader.java:73)
	at java.net.URLClassLoader$1.run(URLClassLoader.java:367)
	at java.net.URLClassLoader$1.run(URLClassLoader.java:361)
	at java.security.AccessController.doPrivileged(Native Method)
	at java.net.URLClassLoader.findClass(URLClassLoader.java:360)
	at java.lang.ClassLoader.loadClass(ClassLoader.java:424)
	at sun.misc.Launcher$AppClassLoader.loadClass(Launcher.java:308)
	at java.lang.ClassLoader.loadClass(ClassLoader.java:357)
	at org.apache.hadoop.yarn.server.resourcemanager.scheduler.capacity.CapacityScheduler.parseQueue(CapacityScheduler.java:635)
	at org.apache.hadoop.yarn.server.resourcemanager.scheduler.capacity.CapacityScheduler.initializeQueues(CapacityScheduler.java:499)
	at org.apache.hadoop.yarn.server.resourcemanager.scheduler.capacity.CapacityScheduler.initScheduler(CapacityScheduler.java:325)
	at org.apache.hadoop.yarn.server.resourcemanager.scheduler.capacity.CapacityScheduler.serviceInit(CapacityScheduler.java:358)
	at org.apache.hadoop.service.AbstractService.init(AbstractService.java:163)
	at org.apache.hadoop.yarn.server.resourcemanager.webapp.TestRMWebApp.mockCapacityScheduler(TestRMWebApp.java:233)
	at org.apache.hadoop.yarn.server.resourcemanager.webapp.TestRMWebApp.mockRm(TestRMWebApp.java:210)
	at org.apache.hadoop.yarn.server.resourcemanager.webapp.TestNodesPage$1.configure(TestNodesPage.java:68)
	at com.google.inject.spi.Elements$RecordingBinder.install(Elements.java:223)
	at com.google.inject.AbstractModule.install(AbstractModule.java:118)
	at org.apache.hadoop.yarn.webapp.test.WebAppTests$1.configure(WebAppTests.java:72)
	at com.google.inject.AbstractModule.configure(AbstractModule.java:59)
	at com.google.inject.spi.Elements$RecordingBinder.install(Elements.java:223)
	at com.google.inject.spi.Elements.getElements(Elements.java:101)
	at com.google.inject.internal.InjectorShell$Builder.build(InjectorShell.java:133)
	at com.google.inject.internal.InternalInjectorCreator.build(InternalInjectorCreator.java:103)
	at com.google.inject.Guice.createInjector(Guice.java:95)
	at com.google.inject.Guice.createInjector(Guice.java:72)
	at com.google.inject.Guice.createInjector(Guice.java:62)
	at org.apache.hadoop.yarn.webapp.test.WebAppTests.createMockInjector(WebAppTests.java:59)
	at org.apache.hadoop.yarn.server.resourcemanager.webapp.TestNodesPage.setUp(TestNodesPage.java:62)


REGRESSION:  org.apache.hadoop.yarn.server.resourcemanager.webapp.TestNodesPage.testNodesBlockRender

Error Message:
org/apache/hadoop/metrics2/MetricsSource

Stack Trace:
java.lang.NoClassDefFoundError: org/apache/hadoop/metrics2/MetricsSource
	at java.net.URLClassLoader$1.run(URLClassLoader.java:372)
	at java.net.URLClassLoader$1.run(URLClassLoader.java:361)
	at java.security.AccessController.doPrivileged(Native Method)
	at java.net.URLClassLoader.findClass(URLClassLoader.java:360)
	at java.lang.ClassLoader.loadClass(ClassLoader.java:424)
	at sun.misc.Launcher$AppClassLoader.loadClass(Launcher.java:308)
	at java.lang.ClassLoader.loadClass(ClassLoader.java:357)
	at java.lang.ClassLoader.defineClass1(Native Method)
	at java.lang.ClassLoader.defineClass(ClassLoader.java:760)
	at java.security.SecureClassLoader.defineClass(SecureClassLoader.java:142)
	at java.net.URLClassLoader.defineClass(URLClassLoader.java:455)
	at java.net.URLClassLoader.access$100(URLClassLoader.java:73)
	at java.net.URLClassLoader$1.run(URLClassLoader.java:367)
	at java.net.URLClassLoader$1.run(URLClassLoader.java:361)
	at java.security.AccessController.doPrivileged(Native Method)
	at java.net.URLClassLoader.findClass(URLClassLoader.java:360)
	at java.lang.ClassLoader.loadClass(ClassLoader.java:424)
	at sun.misc.Launcher$AppClassLoader.loadClass(Launcher.java:308)
	at java.lang.ClassLoader.loadClass(ClassLoader.java:357)
	at org.apache.hadoop.yarn.server.resourcemanager.scheduler.capacity.CapacityScheduler.parseQueue(CapacityScheduler.java:635)
	at org.apache.hadoop.yarn.server.resourcemanager.scheduler.capacity.CapacityScheduler.initializeQueues(CapacityScheduler.java:499)
	at org.apache.hadoop.yarn.server.resourcemanager.scheduler.capacity.CapacityScheduler.initScheduler(CapacityScheduler.java:325)
	at org.apache.hadoop.yarn.server.resourcemanager.scheduler.capacity.CapacityScheduler.serviceInit(CapacityScheduler.java:358)
	at org.apache.hadoop.service.AbstractService.init(AbstractService.java:163)
	at org.apache.hadoop.yarn.server.resourcemanager.webapp.TestRMWebApp.mockCapacityScheduler(TestRMWebApp.java:233)
	at org.apache.hadoop.yarn.server.resourcemanager.webapp.TestRMWebApp.mockRm(TestRMWebApp.java:210)
	at org.apache.hadoop.yarn.server.resourcemanager.webapp.TestNodesPage$1.configure(TestNodesPage.java:68)
	at com.google.inject.spi.Elements$RecordingBinder.install(Elements.java:223)
	at com.google.inject.AbstractModule.install(AbstractModule.java:118)
	at org.apache.hadoop.yarn.webapp.test.WebAppTests$1.configure(WebAppTests.java:72)
	at com.google.inject.AbstractModule.configure(AbstractModule.java:59)
	at com.google.inject.spi.Elements$RecordingBinder.install(Elements.java:223)
	at com.google.inject.spi.Elements.getElements(Elements.java:101)
	at com.google.inject.internal.InjectorShell$Builder.build(InjectorShell.java:133)
	at com.google.inject.internal.InternalInjectorCreator.build(InternalInjectorCreator.java:103)
	at com.google.inject.Guice.createInjector(Guice.java:95)
	at com.google.inject.Guice.createInjector(Guice.java:72)
	at com.google.inject.Guice.createInjector(Guice.java:62)
	at org.apache.hadoop.yarn.webapp.test.WebAppTests.createMockInjector(WebAppTests.java:59)
	at org.apache.hadoop.yarn.server.resourcemanager.webapp.TestNodesPage.setUp(TestNodesPage.java:62)


REGRESSION:  org.apache.hadoop.yarn.server.resourcemanager.webapp.TestNodesPage.testNodesBlockRenderForLostNodes

Error Message:
org/apache/hadoop/metrics2/MetricsSource

Stack Trace:
java.lang.NoClassDefFoundError: org/apache/hadoop/metrics2/MetricsSource
	at java.net.URLClassLoader$1.run(URLClassLoader.java:372)
	at java.net.URLClassLoader$1.run(URLClassLoader.java:361)
	at java.security.AccessController.doPrivileged(Native Method)
	at java.net.URLClassLoader.findClass(URLClassLoader.java:360)
	at java.lang.ClassLoader.loadClass(ClassLoader.java:424)
	at sun.misc.Launcher$AppClassLoader.loadClass(Launcher.java:308)
	at java.lang.ClassLoader.loadClass(ClassLoader.java:357)
	at java.lang.ClassLoader.defineClass1(Native Method)
	at java.lang.ClassLoader.defineClass(ClassLoader.java:760)
	at java.security.SecureClassLoader.defineClass(SecureClassLoader.java:142)
	at java.net.URLClassLoader.defineClass(URLClassLoader.java:455)
	at java.net.URLClassLoader.access$100(URLClassLoader.java:73)
	at java.net.URLClassLoader$1.run(URLClassLoader.java:367)
	at java.net.URLClassLoader$1.run(URLClassLoader.java:361)
	at java.security.AccessController.doPrivileged(Native Method)
	at java.net.URLClassLoader.findClass(URLClassLoader.java:360)
	at java.lang.ClassLoader.loadClass(ClassLoader.java:424)
	at sun.misc.Launcher$AppClassLoader.loadClass(Launcher.java:308)
	at java.lang.ClassLoader.loadClass(ClassLoader.java:357)
	at org.apache.hadoop.yarn.server.resourcemanager.scheduler.capacity.CapacityScheduler.parseQueue(CapacityScheduler.java:635)
	at org.apache.hadoop.yarn.server.resourcemanager.scheduler.capacity.CapacityScheduler.initializeQueues(CapacityScheduler.java:499)
	at org.apache.hadoop.yarn.server.resourcemanager.scheduler.capacity.CapacityScheduler.initScheduler(CapacityScheduler.java:325)
	at org.apache.hadoop.yarn.server.resourcemanager.scheduler.capacity.CapacityScheduler.serviceInit(CapacityScheduler.java:358)
	at org.apache.hadoop.service.AbstractService.init(AbstractService.java:163)
	at org.apache.hadoop.yarn.server.resourcemanager.webapp.TestRMWebApp.mockCapacityScheduler(TestRMWebApp.java:233)
	at org.apache.hadoop.yarn.server.resourcemanager.webapp.TestRMWebApp.mockRm(TestRMWebApp.java:210)
	at org.apache.hadoop.yarn.server.resourcemanager.webapp.TestNodesPage$1.configure(TestNodesPage.java:68)
	at com.google.inject.spi.Elements$RecordingBinder.install(Elements.java:223)
	at com.google.inject.AbstractModule.install(AbstractModule.java:118)
	at org.apache.hadoop.yarn.webapp.test.WebAppTests$1.configure(WebAppTests.java:72)
	at com.google.inject.AbstractModule.configure(AbstractModule.java:59)
	at com.google.inject.spi.Elements$RecordingBinder.install(Elements.java:223)
	at com.google.inject.spi.Elements.getElements(Elements.java:101)
	at com.google.inject.internal.InjectorShell$Builder.build(InjectorShell.java:133)
	at com.google.inject.internal.InternalInjectorCreator.build(InternalInjectorCreator.java:103)
	at com.google.inject.Guice.createInjector(Guice.java:95)
	at com.google.inject.Guice.createInjector(Guice.java:72)
	at com.google.inject.Guice.createInjector(Guice.java:62)
	at org.apache.hadoop.yarn.webapp.test.WebAppTests.createMockInjector(WebAppTests.java:59)
	at org.apache.hadoop.yarn.server.resourcemanager.webapp.TestNodesPage.setUp(TestNodesPage.java:62)


REGRESSION:  org.apache.hadoop.yarn.server.resourcemanager.webapp.TestNodesPage.testNodesBlockRenderForNodeLabelFilterWithAnyLabel

Error Message:
org/apache/hadoop/metrics2/MetricsSource

Stack Trace:
java.lang.NoClassDefFoundError: org/apache/hadoop/metrics2/MetricsSource
	at java.net.URLClassLoader$1.run(URLClassLoader.java:372)
	at java.net.URLClassLoader$1.run(URLClassLoader.java:361)
	at java.security.AccessController.doPrivileged(Native Method)
	at java.net.URLClassLoader.findClass(URLClassLoader.java:360)
	at java.lang.ClassLoader.loadClass(ClassLoader.java:424)
	at sun.misc.Launcher$AppClassLoader.loadClass(Launcher.java:308)
	at java.lang.ClassLoader.loadClass(ClassLoader.java:357)
	at java.lang.ClassLoader.defineClass1(Native Method)
	at java.lang.ClassLoader.defineClass(ClassLoader.java:760)
	at java.security.SecureClassLoader.defineClass(SecureClassLoader.java:142)
	at java.net.URLClassLoader.defineClass(URLClassLoader.java:455)
	at java.net.URLClassLoader.access$100(URLClassLoader.java:73)
	at java.net.URLClassLoader$1.run(URLClassLoader.java:367)
	at java.net.URLClassLoader$1.run(URLClassLoader.java:361)
	at java.security.AccessController.doPrivileged(Native Method)
	at java.net.URLClassLoader.findClass(URLClassLoader.java:360)
	at java.lang.ClassLoader.loadClass(ClassLoader.java:424)
	at sun.misc.Launcher$AppClassLoader.loadClass(Launcher.java:308)
	at java.lang.ClassLoader.loadClass(ClassLoader.java:357)
	at org.apache.hadoop.yarn.server.resourcemanager.scheduler.capacity.CapacityScheduler.parseQueue(CapacityScheduler.java:635)
	at org.apache.hadoop.yarn.server.resourcemanager.scheduler.capacity.CapacityScheduler.initializeQueues(CapacityScheduler.java:499)
	at org.apache.hadoop.yarn.server.resourcemanager.scheduler.capacity.CapacityScheduler.initScheduler(CapacityScheduler.java:325)
	at org.apache.hadoop.yarn.server.resourcemanager.scheduler.capacity.CapacityScheduler.serviceInit(CapacityScheduler.java:358)
	at org.apache.hadoop.service.AbstractService.init(AbstractService.java:163)
	at org.apache.hadoop.yarn.server.resourcemanager.webapp.TestRMWebApp.mockCapacityScheduler(TestRMWebApp.java:233)
	at org.apache.hadoop.yarn.server.resourcemanager.webapp.TestRMWebApp.mockRm(TestRMWebApp.java:210)
	at org.apache.hadoop.yarn.server.resourcemanager.webapp.TestNodesPage$1.configure(TestNodesPage.java:68)
	at com.google.inject.spi.Elements$RecordingBinder.install(Elements.java:223)
	at com.google.inject.AbstractModule.install(AbstractModule.java:118)
	at org.apache.hadoop.yarn.webapp.test.WebAppTests$1.configure(WebAppTests.java:72)
	at com.google.inject.AbstractModule.configure(AbstractModule.java:59)
	at com.google.inject.spi.Elements$RecordingBinder.install(Elements.java:223)
	at com.google.inject.spi.Elements.getElements(Elements.java:101)
	at com.google.inject.internal.InjectorShell$Builder.build(InjectorShell.java:133)
	at com.google.inject.internal.InternalInjectorCreator.build(InternalInjectorCreator.java:103)
	at com.google.inject.Guice.createInjector(Guice.java:95)
	at com.google.inject.Guice.createInjector(Guice.java:72)
	at com.google.inject.Guice.createInjector(Guice.java:62)
	at org.apache.hadoop.yarn.webapp.test.WebAppTests.createMockInjector(WebAppTests.java:59)
	at org.apache.hadoop.yarn.server.resourcemanager.webapp.TestNodesPage.setUp(TestNodesPage.java:62)


REGRESSION:  org.apache.hadoop.yarn.server.resourcemanager.webapp.TestRMWebServicesApps.testAppsQueryFinishBegin

Error Message:
org.apache.hadoop.security.token.TokenIdentifier: Provider org.apache.hadoop.hdfs.security.token.block.BlockTokenIdentifier
not found

Stack Trace:
java.util.ServiceConfigurationError: org.apache.hadoop.security.token.TokenIdentifier: Provider
org.apache.hadoop.hdfs.security.token.block.BlockTokenIdentifier not found
	at java.util.ServiceLoader.fail(ServiceLoader.java:239)
	at java.util.ServiceLoader.access$300(ServiceLoader.java:185)
	at java.util.ServiceLoader$LazyIterator.nextService(ServiceLoader.java:372)
	at java.util.ServiceLoader$LazyIterator.next(ServiceLoader.java:404)
	at java.util.ServiceLoader$1.next(ServiceLoader.java:480)
	at org.apache.hadoop.security.token.Token.getClassForIdentifier(Token.java:114)
	at org.apache.hadoop.security.token.Token.decodeIdentifier(Token.java:135)
	at org.apache.hadoop.yarn.server.resourcemanager.MockAM.registerAppAttempt(MockAM.java:125)
	at org.apache.hadoop.yarn.server.resourcemanager.MockAM.registerAppAttempt(MockAM.java:105)
	at org.apache.hadoop.yarn.server.resourcemanager.webapp.TestRMWebServicesApps.testAppsQueryFinishBegin(TestRMWebServicesApps.java:704)


REGRESSION:  org.apache.hadoop.yarn.server.resourcemanager.webapp.TestRMWebServicesApps.testAppStatistics

Error Message:
null

Stack Trace:
java.lang.NullPointerException: null
	at javax.security.auth.Subject$ClassSet.populateSet(Subject.java:1391)
	at javax.security.auth.Subject$ClassSet.<init>(Subject.java:1353)
	at javax.security.auth.Subject.getPublicCredentials(Subject.java:720)
	at org.apache.hadoop.security.UserGroupInformation.getTokenIdentifiers(UserGroupInformation.java:1439)
	at org.apache.hadoop.yarn.server.resourcemanager.ApplicationMasterService.selectAMRMTokenIdentifier(ApplicationMasterService.java:185)
	at org.apache.hadoop.yarn.server.resourcemanager.ApplicationMasterService.authorizeRequest(ApplicationMasterService.java:214)
	at org.apache.hadoop.yarn.server.resourcemanager.ApplicationMasterService.registerApplicationMaster(ApplicationMasterService.java:241)
	at org.apache.hadoop.yarn.server.resourcemanager.MockAM$1.run(MockAM.java:133)
	at org.apache.hadoop.yarn.server.resourcemanager.MockAM$1.run(MockAM.java:130)
	at java.security.AccessController.doPrivileged(Native Method)
	at javax.security.auth.Subject.doAs(Subject.java:422)
	at org.apache.hadoop.security.UserGroupInformation.doAs(UserGroupInformation.java:1667)
	at org.apache.hadoop.yarn.server.resourcemanager.MockAM.registerAppAttempt(MockAM.java:129)
	at org.apache.hadoop.yarn.server.resourcemanager.MockAM.registerAppAttempt(MockAM.java:105)
	at org.apache.hadoop.yarn.server.resourcemanager.webapp.TestRMWebServicesApps.testAppStatistics(TestRMWebServicesApps.java:989)


REGRESSION:  org.apache.hadoop.yarn.server.resourcemanager.webapp.TestRMWebServicesApps.testMultipleAppAttempts

Error Message:
null

Stack Trace:
java.lang.NullPointerException: null
	at javax.security.auth.Subject$ClassSet.populateSet(Subject.java:1391)
	at javax.security.auth.Subject$ClassSet.<init>(Subject.java:1353)
	at javax.security.auth.Subject.getPublicCredentials(Subject.java:720)
	at org.apache.hadoop.security.UserGroupInformation.getTokenIdentifiers(UserGroupInformation.java:1439)
	at org.apache.hadoop.yarn.server.resourcemanager.ApplicationMasterService.selectAMRMTokenIdentifier(ApplicationMasterService.java:185)
	at org.apache.hadoop.yarn.server.resourcemanager.ApplicationMasterService.authorizeRequest(ApplicationMasterService.java:214)
	at org.apache.hadoop.yarn.server.resourcemanager.ApplicationMasterService.registerApplicationMaster(ApplicationMasterService.java:241)
	at org.apache.hadoop.yarn.server.resourcemanager.MockAM$1.run(MockAM.java:133)
	at org.apache.hadoop.yarn.server.resourcemanager.MockAM$1.run(MockAM.java:130)
	at java.security.AccessController.doPrivileged(Native Method)
	at javax.security.auth.Subject.doAs(Subject.java:422)
	at org.apache.hadoop.security.UserGroupInformation.doAs(UserGroupInformation.java:1667)
	at org.apache.hadoop.yarn.server.resourcemanager.MockAM.registerAppAttempt(MockAM.java:129)
	at org.apache.hadoop.yarn.server.resourcemanager.MockAM.registerAppAttempt(MockAM.java:105)
	at org.apache.hadoop.yarn.server.resourcemanager.MockRM.launchAndRegisterAM(MockRM.java:767)
	at org.apache.hadoop.yarn.server.resourcemanager.webapp.TestRMWebServicesApps.testMultipleAppAttempts(TestRMWebServicesApps.java:1413)


REGRESSION:  org.apache.hadoop.yarn.server.resourcemanager.webapp.TestRMWebServicesApps.testAppsQueryFinishEnd

Error Message:
null

Stack Trace:
java.lang.NullPointerException: null
	at javax.security.auth.Subject$ClassSet.populateSet(Subject.java:1391)
	at javax.security.auth.Subject$ClassSet.<init>(Subject.java:1353)
	at javax.security.auth.Subject.getPublicCredentials(Subject.java:720)
	at org.apache.hadoop.security.UserGroupInformation.getTokenIdentifiers(UserGroupInformation.java:1439)
	at org.apache.hadoop.yarn.server.resourcemanager.ApplicationMasterService.selectAMRMTokenIdentifier(ApplicationMasterService.java:185)
	at org.apache.hadoop.yarn.server.resourcemanager.ApplicationMasterService.authorizeRequest(ApplicationMasterService.java:214)
	at org.apache.hadoop.yarn.server.resourcemanager.ApplicationMasterService.registerApplicationMaster(ApplicationMasterService.java:241)
	at org.apache.hadoop.yarn.server.resourcemanager.MockAM$1.run(MockAM.java:133)
	at org.apache.hadoop.yarn.server.resourcemanager.MockAM$1.run(MockAM.java:130)
	at java.security.AccessController.doPrivileged(Native Method)
	at javax.security.auth.Subject.doAs(Subject.java:422)
	at org.apache.hadoop.security.UserGroupInformation.doAs(UserGroupInformation.java:1667)
	at org.apache.hadoop.yarn.server.resourcemanager.MockAM.registerAppAttempt(MockAM.java:129)
	at org.apache.hadoop.yarn.server.resourcemanager.MockAM.registerAppAttempt(MockAM.java:105)
	at org.apache.hadoop.yarn.server.resourcemanager.webapp.TestRMWebServicesApps.testAppsQueryFinishEnd(TestRMWebServicesApps.java:734)


REGRESSION:  org.apache.hadoop.yarn.server.resourcemanager.webapp.TestRMWebServicesApps.testAppsQueryAppTypes

Error Message:
null

Stack Trace:
java.lang.NullPointerException: null
	at javax.security.auth.Subject$ClassSet.populateSet(Subject.java:1391)
	at javax.security.auth.Subject$ClassSet.<init>(Subject.java:1353)
	at javax.security.auth.Subject.getPublicCredentials(Subject.java:720)
	at org.apache.hadoop.security.UserGroupInformation.getTokenIdentifiers(UserGroupInformation.java:1439)
	at org.apache.hadoop.yarn.server.resourcemanager.ApplicationMasterService.selectAMRMTokenIdentifier(ApplicationMasterService.java:185)
	at org.apache.hadoop.yarn.server.resourcemanager.ApplicationMasterService.authorizeRequest(ApplicationMasterService.java:214)
	at org.apache.hadoop.yarn.server.resourcemanager.ApplicationMasterService.registerApplicationMaster(ApplicationMasterService.java:241)
	at org.apache.hadoop.yarn.server.resourcemanager.MockAM$1.run(MockAM.java:133)
	at org.apache.hadoop.yarn.server.resourcemanager.MockAM$1.run(MockAM.java:130)
	at java.security.AccessController.doPrivileged(Native Method)
	at javax.security.auth.Subject.doAs(Subject.java:422)
	at org.apache.hadoop.security.UserGroupInformation.doAs(UserGroupInformation.java:1667)
	at org.apache.hadoop.yarn.server.resourcemanager.MockAM.registerAppAttempt(MockAM.java:129)
	at org.apache.hadoop.yarn.server.resourcemanager.MockAM.registerAppAttempt(MockAM.java:105)
	at org.apache.hadoop.yarn.server.resourcemanager.webapp.TestRMWebServicesApps.testAppsQueryAppTypes(TestRMWebServicesApps.java:802)


REGRESSION:  org.apache.hadoop.yarn.server.resourcemanager.webapp.TestRMWebServicesApps.testAppsQueryFinishBeginEnd

Error Message:
null

Stack Trace:
java.lang.NullPointerException: null
	at javax.security.auth.Subject$ClassSet.populateSet(Subject.java:1391)
	at javax.security.auth.Subject$ClassSet.<init>(Subject.java:1353)
	at javax.security.auth.Subject.getPublicCredentials(Subject.java:720)
	at org.apache.hadoop.security.UserGroupInformation.getTokenIdentifiers(UserGroupInformation.java:1439)
	at org.apache.hadoop.yarn.server.resourcemanager.ApplicationMasterService.selectAMRMTokenIdentifier(ApplicationMasterService.java:185)
	at org.apache.hadoop.yarn.server.resourcemanager.ApplicationMasterService.authorizeRequest(ApplicationMasterService.java:214)
	at org.apache.hadoop.yarn.server.resourcemanager.ApplicationMasterService.registerApplicationMaster(ApplicationMasterService.java:241)
	at org.apache.hadoop.yarn.server.resourcemanager.MockAM$1.run(MockAM.java:133)
	at org.apache.hadoop.yarn.server.resourcemanager.MockAM$1.run(MockAM.java:130)
	at java.security.AccessController.doPrivileged(Native Method)
	at javax.security.auth.Subject.doAs(Subject.java:422)
	at org.apache.hadoop.security.UserGroupInformation.doAs(UserGroupInformation.java:1667)
	at org.apache.hadoop.yarn.server.resourcemanager.MockAM.registerAppAttempt(MockAM.java:129)
	at org.apache.hadoop.yarn.server.resourcemanager.MockAM.registerAppAttempt(MockAM.java:105)
	at org.apache.hadoop.yarn.server.resourcemanager.webapp.TestRMWebServicesApps.testAppsQueryFinishBeginEnd(TestRMWebServicesApps.java:768)



Mime
  • Unnamed multipart/mixed (inline, None, 0 bytes)
View raw message