hadoop-yarn-dev mailing list archives

Site index · List index
Message view « Date » · « Thread »
Top « Date » · « Thread »
From Apache Jenkins Server <jenk...@builds.apache.org>
Subject Build failed in Jenkins: Hadoop-Yarn-trunk #979
Date Tue, 07 Jul 2015 10:46:24 GMT
See <https://builds.apache.org/job/Hadoop-Yarn-trunk/979/changes>

Changes:

[vinayakumarb] HDFS-8686. WebHdfsFileSystem#getXAttr(Path p, final String name) doesn't work
if namespace is in capitals (Contributed by kanaka kumar avvaru)

[cnauroth] HADOOP-12045. Enable LocalFileSystem#setTimes to change atime. Contributed by Kazuho
Fujii.

[cdouglas] HADOOP-12185. NetworkTopology is not efficient adding/getting/removing nodes. Contributed
by Inigo Goiri

[jing9] HDFS-8652. Track BlockInfo instead of Block in CorruptReplicasMap. Contributed by
Jing Zhao.

[vinodkv] Release process for 2.7.1: Set the release date for 2.7.1.

[cmccabe] HADOOP-11974. Fix FIONREAD #include on Solaris (Alan Burlison via Colin P. McCabe)

[devaraj] YARN-3837. javadocs of TimelineAuthenticationFilterInitializer give wrong

------------------------------------------
[...truncated 7265 lines...]
     [exec] Dependee "<https://builds.apache.org/job/Hadoop-Yarn-trunk/ws/hadoop-yarn-project/hadoop-yarn/hadoop-yarn-server/hadoop-yarn-server-nodemanager/target/native/CMakeFiles/CMakeDirectoryInformation.cmake">
is newer than depender "<https://builds.apache.org/job/Hadoop-Yarn-trunk/ws/hadoop-yarn-project/hadoop-yarn/hadoop-yarn-server/hadoop-yarn-server-nodemanager/target/native/CMakeFiles/test-container-executor.dir/depend.internal".>
     [exec] Scanning dependencies of target test-container-executor
     [exec] make[2]: Leaving directory `<https://builds.apache.org/job/Hadoop-Yarn-trunk/ws/hadoop-yarn-project/hadoop-yarn/hadoop-yarn-server/hadoop-yarn-server-nodemanager/target/native'>
     [exec] make -f CMakeFiles/test-container-executor.dir/build.make CMakeFiles/test-container-executor.dir/build
     [exec] make[2]: Entering directory `<https://builds.apache.org/job/Hadoop-Yarn-trunk/ws/hadoop-yarn-project/hadoop-yarn/hadoop-yarn-server/hadoop-yarn-server-nodemanager/target/native'>
     [exec] /usr/bin/cmake -E cmake_progress_report <https://builds.apache.org/job/Hadoop-Yarn-trunk/ws/hadoop-yarn-project/hadoop-yarn/hadoop-yarn-server/hadoop-yarn-server-nodemanager/target/native/CMakeFiles>
4
     [exec] [100%] Building C object CMakeFiles/test-container-executor.dir/main/native/container-executor/test/test-container-executor.c.o
     [exec] /usr/bin/cc   -g -O2 -Wall -pthread  -D_GNU_SOURCE -I<https://builds.apache.org/job/Hadoop-Yarn-trunk/ws/hadoop-yarn-project/hadoop-yarn/hadoop-yarn-server/hadoop-yarn-server-nodemanager/src>
-I<https://builds.apache.org/job/Hadoop-Yarn-trunk/ws/hadoop-yarn-project/hadoop-yarn/hadoop-yarn-server/hadoop-yarn-server-nodemanager/target/native>
-I<https://builds.apache.org/job/Hadoop-Yarn-trunk/ws/hadoop-yarn-project/hadoop-yarn/hadoop-yarn-server/hadoop-yarn-server-nodemanager/src/main/native/container-executor>
-I<https://builds.apache.org/job/Hadoop-Yarn-trunk/ws/hadoop-yarn-project/hadoop-yarn/hadoop-yarn-server/hadoop-yarn-server-nodemanager/src/main/native/container-executor/impl>
   -o CMakeFiles/test-container-executor.dir/main/native/container-executor/test/test-container-executor.c.o
  -c <https://builds.apache.org/job/Hadoop-Yarn-trunk/ws/hadoop-yarn-project/hadoop-yarn/hadoop-yarn-server/hadoop-yarn-server-nodemanager/src/main/native/container-executor/test/test-container-executor.c>
     [exec] <https://builds.apache.org/job/Hadoop-Yarn-trunk/ws/hadoop-yarn-project/hadoop-yarn/hadoop-yarn-server/hadoop-yarn-server-nodemanager/src/main/native/container-executor/test/test-container-executor.c>:
In function 'main':
     [exec] <https://builds.apache.org/job/Hadoop-Yarn-trunk/ws/hadoop-yarn-project/hadoop-yarn/hadoop-yarn-server/hadoop-yarn-server-nodemanager/src/main/native/container-executor/test/test-container-executor.c>:821:10:
warning: ignoring return value of 'seteuid', declared with attribute warn_unused_result [-Wunused-result]
     [exec]    seteuid(0);
     [exec]           ^
     [exec] Linking C executable target/usr/local/bin/test-container-executor
     [exec] /usr/bin/cmake -E cmake_link_script CMakeFiles/test-container-executor.dir/link.txt
--verbose=1
     [exec] /usr/bin/cc   -g -O2 -Wall -pthread  -D_GNU_SOURCE     CMakeFiles/test-container-executor.dir/main/native/container-executor/test/test-container-executor.c.o
 -o target/usr/local/bin/test-container-executor -rdynamic libcontainer.a 
     [exec] make[2]: Leaving directory `<https://builds.apache.org/job/Hadoop-Yarn-trunk/ws/hadoop-yarn-project/hadoop-yarn/hadoop-yarn-server/hadoop-yarn-server-nodemanager/target/native'>
     [exec] /usr/bin/cmake -E cmake_progress_report <https://builds.apache.org/job/Hadoop-Yarn-trunk/ws/hadoop-yarn-project/hadoop-yarn/hadoop-yarn-server/hadoop-yarn-server-nodemanager/target/native/CMakeFiles>
 4
     [exec] [100%] Built target test-container-executor
     [exec] make[1]: Leaving directory `<https://builds.apache.org/job/Hadoop-Yarn-trunk/ws/hadoop-yarn-project/hadoop-yarn/hadoop-yarn-server/hadoop-yarn-server-nodemanager/target/native'>
     [exec] /usr/bin/cmake -E cmake_progress_start <https://builds.apache.org/job/Hadoop-Yarn-trunk/ws/hadoop-yarn-project/hadoop-yarn/hadoop-yarn-server/hadoop-yarn-server-nodemanager/target/native/CMakeFiles>
0
     [exec] [ 50%] Built target container
     [exec] [ 75%] Built target container-executor
     [exec] [100%] Built target test-container-executor
[INFO] Executed tasks
[INFO] 
[INFO] --- maven-resources-plugin:2.6:testResources (default-testResources) @ hadoop-yarn-server-nodemanager
---
[INFO] Using 'UTF-8' encoding to copy filtered resources.
[INFO] Copying 5 resources
[INFO] 
[INFO] --- maven-compiler-plugin:3.1:testCompile (default-testCompile) @ hadoop-yarn-server-nodemanager
---
[INFO] Changes detected - recompiling the module!
[INFO] Compiling 73 source files to <https://builds.apache.org/job/Hadoop-Yarn-trunk/ws/hadoop-yarn-project/hadoop-yarn/hadoop-yarn-server/hadoop-yarn-server-nodemanager/target/test-classes>
[WARNING] <https://builds.apache.org/job/Hadoop-Yarn-trunk/ws/hadoop-yarn-project/hadoop-yarn/hadoop-yarn-server/hadoop-yarn-server-nodemanager/src/test/java/org/apache/hadoop/yarn/server/nodemanager/containermanager/launcher/TestContainerLaunch.java>:
<https://builds.apache.org/job/Hadoop-Yarn-trunk/ws/hadoop-yarn-project/hadoop-yarn/hadoop-yarn-server/hadoop-yarn-server-nodemanager/src/test/java/org/apache/hadoop/yarn/server/nodemanager/containermanager/launcher/TestContainerLaunch.java>
uses or overrides a deprecated API.
[WARNING] <https://builds.apache.org/job/Hadoop-Yarn-trunk/ws/hadoop-yarn-project/hadoop-yarn/hadoop-yarn-server/hadoop-yarn-server-nodemanager/src/test/java/org/apache/hadoop/yarn/server/nodemanager/containermanager/launcher/TestContainerLaunch.java>:
Recompile with -Xlint:deprecation for details.
[WARNING] <https://builds.apache.org/job/Hadoop-Yarn-trunk/ws/hadoop-yarn-project/hadoop-yarn/hadoop-yarn-server/hadoop-yarn-server-nodemanager/src/test/java/org/apache/hadoop/yarn/server/nodemanager/containermanager/TestAuxServices.java>:
<https://builds.apache.org/job/Hadoop-Yarn-trunk/ws/hadoop-yarn-project/hadoop-yarn/hadoop-yarn-server/hadoop-yarn-server-nodemanager/src/test/java/org/apache/hadoop/yarn/server/nodemanager/containermanager/TestAuxServices.java>
uses unchecked or unsafe operations.
[WARNING] <https://builds.apache.org/job/Hadoop-Yarn-trunk/ws/hadoop-yarn-project/hadoop-yarn/hadoop-yarn-server/hadoop-yarn-server-nodemanager/src/test/java/org/apache/hadoop/yarn/server/nodemanager/containermanager/TestAuxServices.java>:
Recompile with -Xlint:unchecked for details.
[INFO] 
[INFO] --- maven-surefire-plugin:2.17:test (default-test) @ hadoop-yarn-server-nodemanager
---
[INFO] Surefire report directory: <https://builds.apache.org/job/Hadoop-Yarn-trunk/ws/hadoop-yarn-project/hadoop-yarn/hadoop-yarn-server/hadoop-yarn-server-nodemanager/target/surefire-reports>

-------------------------------------------------------
 T E S T S
-------------------------------------------------------

-------------------------------------------------------
 T E S T S
-------------------------------------------------------
Running org.apache.hadoop.yarn.server.nodemanager.TestDirectoryCollection
Tests run: 7, Failures: 0, Errors: 0, Skipped: 0, Time elapsed: 0.914 sec - in org.apache.hadoop.yarn.server.nodemanager.TestDirectoryCollection
Running org.apache.hadoop.yarn.server.nodemanager.TestLinuxContainerExecutor
Tests run: 8, Failures: 0, Errors: 0, Skipped: 8, Time elapsed: 1.129 sec - in org.apache.hadoop.yarn.server.nodemanager.TestLinuxContainerExecutor
Running org.apache.hadoop.yarn.server.nodemanager.webapp.TestContainerLogsPage
Tests run: 4, Failures: 0, Errors: 0, Skipped: 1, Time elapsed: 1.325 sec - in org.apache.hadoop.yarn.server.nodemanager.webapp.TestContainerLogsPage
Running org.apache.hadoop.yarn.server.nodemanager.webapp.TestNMWebServices
Tests run: 11, Failures: 0, Errors: 0, Skipped: 0, Time elapsed: 6.295 sec - in org.apache.hadoop.yarn.server.nodemanager.webapp.TestNMWebServices
Running org.apache.hadoop.yarn.server.nodemanager.webapp.TestNMWebServicesContainers
Tests run: 12, Failures: 0, Errors: 0, Skipped: 0, Time elapsed: 6.566 sec - in org.apache.hadoop.yarn.server.nodemanager.webapp.TestNMWebServicesContainers
Running org.apache.hadoop.yarn.server.nodemanager.webapp.TestNMWebServer
Tests run: 3, Failures: 0, Errors: 0, Skipped: 0, Time elapsed: 2.508 sec - in org.apache.hadoop.yarn.server.nodemanager.webapp.TestNMWebServer
Running org.apache.hadoop.yarn.server.nodemanager.webapp.TestNMWebServicesApps
Tests run: 19, Failures: 0, Errors: 0, Skipped: 0, Time elapsed: 8.36 sec - in org.apache.hadoop.yarn.server.nodemanager.webapp.TestNMWebServicesApps
Running org.apache.hadoop.yarn.server.nodemanager.recovery.TestNMLeveldbStateStoreService
Tests run: 12, Failures: 0, Errors: 0, Skipped: 0, Time elapsed: 2.089 sec - in org.apache.hadoop.yarn.server.nodemanager.recovery.TestNMLeveldbStateStoreService
Running org.apache.hadoop.yarn.server.nodemanager.TestNodeManager
Tests run: 1, Failures: 0, Errors: 0, Skipped: 0, Time elapsed: 1.145 sec - in org.apache.hadoop.yarn.server.nodemanager.TestNodeManager
Running org.apache.hadoop.yarn.server.nodemanager.TestNodeHealthService
Tests run: 1, Failures: 0, Errors: 0, Skipped: 0, Time elapsed: 1.173 sec - in org.apache.hadoop.yarn.server.nodemanager.TestNodeHealthService
Running org.apache.hadoop.yarn.server.nodemanager.util.TestCgroupsLCEResourcesHandler
Tests run: 5, Failures: 0, Errors: 0, Skipped: 0, Time elapsed: 1.324 sec - in org.apache.hadoop.yarn.server.nodemanager.util.TestCgroupsLCEResourcesHandler
Running org.apache.hadoop.yarn.server.nodemanager.util.TestNodeManagerHardwareUtils
Tests run: 3, Failures: 0, Errors: 0, Skipped: 0, Time elapsed: 0.839 sec - in org.apache.hadoop.yarn.server.nodemanager.util.TestNodeManagerHardwareUtils
Running org.apache.hadoop.yarn.server.nodemanager.util.TestProcessIdFileReader
Tests run: 3, Failures: 0, Errors: 0, Skipped: 0, Time elapsed: 0.208 sec - in org.apache.hadoop.yarn.server.nodemanager.util.TestProcessIdFileReader
Running org.apache.hadoop.yarn.server.nodemanager.TestNodeStatusUpdaterForLabels
Tests run: 1, Failures: 0, Errors: 0, Skipped: 0, Time elapsed: 4.107 sec - in org.apache.hadoop.yarn.server.nodemanager.TestNodeStatusUpdaterForLabels
Running org.apache.hadoop.yarn.server.nodemanager.api.protocolrecords.impl.pb.TestPBLocalizerRPC
Tests run: 1, Failures: 0, Errors: 0, Skipped: 0, Time elapsed: 1.06 sec - in org.apache.hadoop.yarn.server.nodemanager.api.protocolrecords.impl.pb.TestPBLocalizerRPC
Running org.apache.hadoop.yarn.server.nodemanager.api.protocolrecords.impl.pb.TestPBRecordImpl
Tests run: 4, Failures: 0, Errors: 0, Skipped: 0, Time elapsed: 0.614 sec - in org.apache.hadoop.yarn.server.nodemanager.api.protocolrecords.impl.pb.TestPBRecordImpl
Running org.apache.hadoop.yarn.server.nodemanager.TestNodeStatusUpdater
Tests run: 14, Failures: 0, Errors: 0, Skipped: 0, Time elapsed: 65.447 sec - in org.apache.hadoop.yarn.server.nodemanager.TestNodeStatusUpdater
Running org.apache.hadoop.yarn.server.nodemanager.TestContainerExecutor
Tests run: 5, Failures: 0, Errors: 0, Skipped: 3, Time elapsed: 0.863 sec - in org.apache.hadoop.yarn.server.nodemanager.TestContainerExecutor
Running org.apache.hadoop.yarn.server.nodemanager.TestDockerContainerExecutor
Tests run: 1, Failures: 0, Errors: 0, Skipped: 0, Time elapsed: 5.272 sec - in org.apache.hadoop.yarn.server.nodemanager.TestDockerContainerExecutor
Running org.apache.hadoop.yarn.server.nodemanager.TestContainerManagerWithLCE
Tests run: 11, Failures: 0, Errors: 0, Skipped: 0, Time elapsed: 1.925 sec - in org.apache.hadoop.yarn.server.nodemanager.TestContainerManagerWithLCE
Running org.apache.hadoop.yarn.server.nodemanager.TestNMAuditLogger
Tests run: 3, Failures: 0, Errors: 0, Skipped: 0, Time elapsed: 1.099 sec - in org.apache.hadoop.yarn.server.nodemanager.TestNMAuditLogger
Running org.apache.hadoop.yarn.server.nodemanager.containermanager.application.TestApplication
Tests run: 8, Failures: 0, Errors: 0, Skipped: 0, Time elapsed: 5.545 sec - in org.apache.hadoop.yarn.server.nodemanager.containermanager.application.TestApplication
Running org.apache.hadoop.yarn.server.nodemanager.containermanager.TestNMProxy
Tests run: 2, Failures: 0, Errors: 0, Skipped: 0, Time elapsed: 4.466 sec - in org.apache.hadoop.yarn.server.nodemanager.containermanager.TestNMProxy
Running org.apache.hadoop.yarn.server.nodemanager.containermanager.linux.privileged.TestPrivilegedOperationExecutor
Tests run: 4, Failures: 0, Errors: 0, Skipped: 0, Time elapsed: 0.703 sec - in org.apache.hadoop.yarn.server.nodemanager.containermanager.linux.privileged.TestPrivilegedOperationExecutor
Running org.apache.hadoop.yarn.server.nodemanager.containermanager.linux.resources.TestCGroupsBlkioResourceHandlerImpl
Tests run: 5, Failures: 0, Errors: 0, Skipped: 0, Time elapsed: 0.485 sec - in org.apache.hadoop.yarn.server.nodemanager.containermanager.linux.resources.TestCGroupsBlkioResourceHandlerImpl
Running org.apache.hadoop.yarn.server.nodemanager.containermanager.linux.resources.TestTrafficController
Tests run: 5, Failures: 0, Errors: 0, Skipped: 0, Time elapsed: 0.943 sec - in org.apache.hadoop.yarn.server.nodemanager.containermanager.linux.resources.TestTrafficController
Running org.apache.hadoop.yarn.server.nodemanager.containermanager.linux.resources.TestCGroupsHandlerImpl
Tests run: 4, Failures: 0, Errors: 0, Skipped: 0, Time elapsed: 0.917 sec - in org.apache.hadoop.yarn.server.nodemanager.containermanager.linux.resources.TestCGroupsHandlerImpl
Running org.apache.hadoop.yarn.server.nodemanager.containermanager.linux.resources.TestTrafficControlBandwidthHandlerImpl
Tests run: 2, Failures: 0, Errors: 0, Skipped: 0, Time elapsed: 0.889 sec - in org.apache.hadoop.yarn.server.nodemanager.containermanager.linux.resources.TestTrafficControlBandwidthHandlerImpl
Running org.apache.hadoop.yarn.server.nodemanager.containermanager.linux.resources.TestResourceHandlerModule
Tests run: 2, Failures: 0, Errors: 0, Skipped: 0, Time elapsed: 0.697 sec - in org.apache.hadoop.yarn.server.nodemanager.containermanager.linux.resources.TestResourceHandlerModule
Running org.apache.hadoop.yarn.server.nodemanager.containermanager.monitor.TestContainersMonitor
Tests run: 3, Failures: 0, Errors: 0, Skipped: 0, Time elapsed: 7.356 sec - in org.apache.hadoop.yarn.server.nodemanager.containermanager.monitor.TestContainersMonitor
Running org.apache.hadoop.yarn.server.nodemanager.containermanager.monitor.TestContainerMetrics
Tests run: 2, Failures: 0, Errors: 0, Skipped: 0, Time elapsed: 0.932 sec - in org.apache.hadoop.yarn.server.nodemanager.containermanager.monitor.TestContainerMetrics
Running org.apache.hadoop.yarn.server.nodemanager.containermanager.logaggregation.TestLogAggregationService
Tests run: 18, Failures: 0, Errors: 0, Skipped: 0, Time elapsed: 31.849 sec - in org.apache.hadoop.yarn.server.nodemanager.containermanager.logaggregation.TestLogAggregationService
Running org.apache.hadoop.yarn.server.nodemanager.containermanager.localizer.TestLocalCacheDirectoryManager
Tests run: 5, Failures: 0, Errors: 0, Skipped: 0, Time elapsed: 1.544 sec - in org.apache.hadoop.yarn.server.nodemanager.containermanager.localizer.TestLocalCacheDirectoryManager
Running org.apache.hadoop.yarn.server.nodemanager.containermanager.localizer.TestLocalResource
Tests run: 2, Failures: 0, Errors: 0, Skipped: 0, Time elapsed: 0.407 sec - in org.apache.hadoop.yarn.server.nodemanager.containermanager.localizer.TestLocalResource
Running org.apache.hadoop.yarn.server.nodemanager.containermanager.localizer.sharedcache.TestSharedCacheUploadService
Tests run: 2, Failures: 0, Errors: 0, Skipped: 0, Time elapsed: 0.83 sec - in org.apache.hadoop.yarn.server.nodemanager.containermanager.localizer.sharedcache.TestSharedCacheUploadService
Running org.apache.hadoop.yarn.server.nodemanager.containermanager.localizer.sharedcache.TestSharedCacheUploader
Tests run: 6, Failures: 0, Errors: 0, Skipped: 0, Time elapsed: 1.167 sec - in org.apache.hadoop.yarn.server.nodemanager.containermanager.localizer.sharedcache.TestSharedCacheUploader
Running org.apache.hadoop.yarn.server.nodemanager.containermanager.localizer.TestLocalResourcesTrackerImpl
Tests run: 8, Failures: 0, Errors: 0, Skipped: 0, Time elapsed: 1.488 sec - in org.apache.hadoop.yarn.server.nodemanager.containermanager.localizer.TestLocalResourcesTrackerImpl
Running org.apache.hadoop.yarn.server.nodemanager.containermanager.localizer.TestContainerLocalizer
Tests run: 3, Failures: 0, Errors: 0, Skipped: 0, Time elapsed: 1.495 sec - in org.apache.hadoop.yarn.server.nodemanager.containermanager.localizer.TestContainerLocalizer
Running org.apache.hadoop.yarn.server.nodemanager.containermanager.localizer.TestLocalizedResource
Tests run: 1, Failures: 0, Errors: 0, Skipped: 0, Time elapsed: 0.652 sec - in org.apache.hadoop.yarn.server.nodemanager.containermanager.localizer.TestLocalizedResource
Running org.apache.hadoop.yarn.server.nodemanager.containermanager.localizer.TestResourceLocalizationService
Tests run: 13, Failures: 0, Errors: 0, Skipped: 0, Time elapsed: 6.204 sec - in org.apache.hadoop.yarn.server.nodemanager.containermanager.localizer.TestResourceLocalizationService
Running org.apache.hadoop.yarn.server.nodemanager.containermanager.localizer.TestResourceRetention
Tests run: 1, Failures: 0, Errors: 0, Skipped: 0, Time elapsed: 0.938 sec - in org.apache.hadoop.yarn.server.nodemanager.containermanager.localizer.TestResourceRetention
Running org.apache.hadoop.yarn.server.nodemanager.containermanager.launcher.TestContainerLaunch
Tests run: 17, Failures: 0, Errors: 0, Skipped: 5, Time elapsed: 20.644 sec - in org.apache.hadoop.yarn.server.nodemanager.containermanager.launcher.TestContainerLaunch
Running org.apache.hadoop.yarn.server.nodemanager.containermanager.TestContainerManager
Tests run: 11, Failures: 0, Errors: 0, Skipped: 0, Time elapsed: 23.513 sec - in org.apache.hadoop.yarn.server.nodemanager.containermanager.TestContainerManager
Running org.apache.hadoop.yarn.server.nodemanager.containermanager.TestAuxServices
Tests run: 6, Failures: 0, Errors: 0, Skipped: 0, Time elapsed: 1.069 sec - in org.apache.hadoop.yarn.server.nodemanager.containermanager.TestAuxServices
Running org.apache.hadoop.yarn.server.nodemanager.containermanager.loghandler.TestNonAggregatingLogHandler
Tests run: 6, Failures: 0, Errors: 0, Skipped: 0, Time elapsed: 1.697 sec - in org.apache.hadoop.yarn.server.nodemanager.containermanager.loghandler.TestNonAggregatingLogHandler
Running org.apache.hadoop.yarn.server.nodemanager.containermanager.container.TestContainer
Tests run: 18, Failures: 0, Errors: 0, Skipped: 0, Time elapsed: 2.254 sec - in org.apache.hadoop.yarn.server.nodemanager.containermanager.container.TestContainer
Running org.apache.hadoop.yarn.server.nodemanager.containermanager.TestContainerManagerRecovery
Tests run: 2, Failures: 0, Errors: 0, Skipped: 0, Time elapsed: 10.231 sec - in org.apache.hadoop.yarn.server.nodemanager.containermanager.TestContainerManagerRecovery
Running org.apache.hadoop.yarn.server.nodemanager.TestRecordFactory
Tests run: 1, Failures: 0, Errors: 0, Skipped: 0, Time elapsed: 0.227 sec - in org.apache.hadoop.yarn.server.nodemanager.TestRecordFactory
Running org.apache.hadoop.yarn.server.nodemanager.TestEventFlow
Tests run: 1, Failures: 0, Errors: 0, Skipped: 0, Time elapsed: 5.816 sec - in org.apache.hadoop.yarn.server.nodemanager.TestEventFlow
Running org.apache.hadoop.yarn.server.nodemanager.security.TestNMContainerTokenSecretManager
Tests run: 1, Failures: 0, Errors: 0, Skipped: 0, Time elapsed: 1.154 sec - in org.apache.hadoop.yarn.server.nodemanager.security.TestNMContainerTokenSecretManager
Running org.apache.hadoop.yarn.server.nodemanager.security.TestNMTokenSecretManagerInNM
Tests run: 1, Failures: 0, Errors: 0, Skipped: 0, Time elapsed: 1.105 sec - in org.apache.hadoop.yarn.server.nodemanager.security.TestNMTokenSecretManagerInNM
Running org.apache.hadoop.yarn.server.nodemanager.TestRPCFactories
Tests run: 1, Failures: 0, Errors: 0, Skipped: 0, Time elapsed: 0.842 sec - in org.apache.hadoop.yarn.server.nodemanager.TestRPCFactories
Running org.apache.hadoop.yarn.server.nodemanager.TestDeletionService
Tests run: 6, Failures: 0, Errors: 1, Skipped: 0, Time elapsed: 23.083 sec <<< FAILURE!
- in org.apache.hadoop.yarn.server.nodemanager.TestDeletionService
testRelativeDelete(org.apache.hadoop.yarn.server.nodemanager.TestDeletionService)  Time elapsed:
0.244 sec  <<< ERROR!
java.nio.file.NoSuchFileException: <https://builds.apache.org/job/Hadoop-Yarn-trunk/ws/hadoop-yarn-project/hadoop-yarn/hadoop-yarn-server/hadoop-yarn-server-nodemanager/target/org.apache.hadoop.yarn.server.nodemanager.TestDeletionService/1369480443411756082/-4239784472829180294/-7656219818046308155>
	at sun.nio.fs.UnixException.translateToIOException(UnixException.java:86)
	at sun.nio.fs.UnixException.rethrowAsIOException(UnixException.java:102)
	at sun.nio.fs.UnixException.rethrowAsIOException(UnixException.java:107)
	at sun.nio.fs.UnixFileAttributeViews$Basic.readAttributes(UnixFileAttributeViews.java:55)
	at sun.nio.fs.UnixFileSystemProvider.readAttributes(UnixFileSystemProvider.java:144)
	at sun.nio.fs.LinuxFileSystemProvider.readAttributes(LinuxFileSystemProvider.java:97)
	at java.nio.file.Files.readAttributes(Files.java:1684)
	at org.apache.hadoop.fs.RawLocalFileSystem$DeprecatedRawLocalFileStatus.<init>(RawLocalFileSystem.java:653)
	at org.apache.hadoop.fs.RawLocalFileSystem.deprecatedGetFileStatus(RawLocalFileSystem.java:634)
	at org.apache.hadoop.fs.RawLocalFileSystem.getFileLinkStatusInternal(RawLocalFileSystem.java:850)
	at org.apache.hadoop.fs.RawLocalFileSystem.getFileStatus(RawLocalFileSystem.java:627)
	at org.apache.hadoop.fs.DelegateToFileSystem.getFileStatus(DelegateToFileSystem.java:110)
	at org.apache.hadoop.fs.FilterFs.getFileStatus(FilterFs.java:121)
	at org.apache.hadoop.fs.FileContext$15.next(FileContext.java:1160)
	at org.apache.hadoop.fs.FileContext$15.next(FileContext.java:1156)
	at org.apache.hadoop.fs.FSLinkResolver.resolve(FSLinkResolver.java:90)
	at org.apache.hadoop.fs.FileContext.getFileStatus(FileContext.java:1156)
	at org.apache.hadoop.fs.FileContext$Util.exists(FileContext.java:1621)
	at org.apache.hadoop.yarn.server.nodemanager.TestDeletionService.testRelativeDelete(TestDeletionService.java:170)

Running org.apache.hadoop.yarn.server.nodemanager.TestDefaultContainerExecutor
Tests run: 3, Failures: 0, Errors: 0, Skipped: 0, Time elapsed: 11.727 sec - in org.apache.hadoop.yarn.server.nodemanager.TestDefaultContainerExecutor
Running org.apache.hadoop.yarn.server.nodemanager.TestNodeManagerShutdown
Tests run: 2, Failures: 0, Errors: 0, Skipped: 0, Time elapsed: 6.113 sec - in org.apache.hadoop.yarn.server.nodemanager.TestNodeManagerShutdown
Running org.apache.hadoop.yarn.server.nodemanager.TestDockerContainerExecutorWithMocks
Tests run: 4, Failures: 0, Errors: 0, Skipped: 0, Time elapsed: 1.304 sec - in org.apache.hadoop.yarn.server.nodemanager.TestDockerContainerExecutorWithMocks
Running org.apache.hadoop.yarn.server.nodemanager.metrics.TestNodeManagerMetrics
Tests run: 1, Failures: 0, Errors: 0, Skipped: 0, Time elapsed: 0.812 sec - in org.apache.hadoop.yarn.server.nodemanager.metrics.TestNodeManagerMetrics
Running org.apache.hadoop.yarn.server.nodemanager.TestLocalDirsHandlerService
Tests run: 3, Failures: 0, Errors: 0, Skipped: 0, Time elapsed: 1.01 sec - in org.apache.hadoop.yarn.server.nodemanager.TestLocalDirsHandlerService
Running org.apache.hadoop.yarn.server.nodemanager.TestNodeManagerResync
Tests run: 5, Failures: 0, Errors: 0, Skipped: 0, Time elapsed: 21.06 sec - in org.apache.hadoop.yarn.server.nodemanager.TestNodeManagerResync
Running org.apache.hadoop.yarn.server.nodemanager.TestNodeManagerReboot
Tests run: 1, Failures: 0, Errors: 0, Skipped: 0, Time elapsed: 6.079 sec - in org.apache.hadoop.yarn.server.nodemanager.TestNodeManagerReboot
Running org.apache.hadoop.yarn.server.nodemanager.TestLinuxContainerExecutorWithMocks
Tests run: 8, Failures: 0, Errors: 0, Skipped: 0, Time elapsed: 1.298 sec - in org.apache.hadoop.yarn.server.nodemanager.TestLinuxContainerExecutorWithMocks

Results :

Tests in error: 
  TestDeletionService.testRelativeDelete:170 ยป NoSuchFile /home/jenkins/jenkins-...

Tests run: 323, Failures: 0, Errors: 1, Skipped: 17

[INFO] ------------------------------------------------------------------------
[INFO] Reactor Summary:
[INFO] 
[INFO] Apache Hadoop YARN ................................ SUCCESS [  3.169 s]
[INFO] Apache Hadoop YARN API ............................ SUCCESS [03:36 min]
[INFO] Apache Hadoop YARN Common ......................... SUCCESS [02:58 min]
[INFO] Apache Hadoop YARN Server ......................... SUCCESS [  0.100 s]
[INFO] Apache Hadoop YARN Server Common .................. SUCCESS [ 44.598 s]
[INFO] Apache Hadoop YARN NodeManager .................... FAILURE [05:45 min]
[INFO] Apache Hadoop YARN Web Proxy ...................... SKIPPED
[INFO] Apache Hadoop YARN ApplicationHistoryService ...... SKIPPED
[INFO] Apache Hadoop YARN ResourceManager ................ SKIPPED
[INFO] Apache Hadoop YARN Server Tests ................... SKIPPED
[INFO] Apache Hadoop YARN Client ......................... SKIPPED
[INFO] Apache Hadoop YARN SharedCacheManager ............. SKIPPED
[INFO] Apache Hadoop YARN Applications ................... SKIPPED
[INFO] Apache Hadoop YARN DistributedShell ............... SKIPPED
[INFO] Apache Hadoop YARN Unmanaged Am Launcher .......... SKIPPED
[INFO] Apache Hadoop YARN Site ........................... SKIPPED
[INFO] Apache Hadoop YARN Registry ....................... SKIPPED
[INFO] Apache Hadoop YARN Project ........................ SKIPPED
[INFO] ------------------------------------------------------------------------
[INFO] BUILD FAILURE
[INFO] ------------------------------------------------------------------------
[INFO] Total time: 13:09 min
[INFO] Finished at: 2015-07-07T10:46:25+00:00
[INFO] Final Memory: 72M/955M
[INFO] ------------------------------------------------------------------------
[ERROR] Failed to execute goal org.apache.maven.plugins:maven-surefire-plugin:2.17:test (default-test)
on project hadoop-yarn-server-nodemanager: There are test failures.
[ERROR] 
[ERROR] Please refer to <https://builds.apache.org/job/Hadoop-Yarn-trunk/ws/hadoop-yarn-project/hadoop-yarn/hadoop-yarn-server/hadoop-yarn-server-nodemanager/target/surefire-reports>
for the individual test results.
[ERROR] -> [Help 1]
[ERROR] 
[ERROR] To see the full stack trace of the errors, re-run Maven with the -e switch.
[ERROR] Re-run Maven using the -X switch to enable full debug logging.
[ERROR] 
[ERROR] For more information about the errors and possible solutions, please read the following
articles:
[ERROR] [Help 1] http://cwiki.apache.org/confluence/display/MAVEN/MojoFailureException
[ERROR] 
[ERROR] After correcting the problems, you can resume the build with the command
[ERROR]   mvn <goals> -rf :hadoop-yarn-server-nodemanager
Build step 'Execute shell' marked build as failure
Archiving artifacts
Recording test results
Updating HADOOP-12045
Updating HADOOP-11974
Updating YARN-3837
Updating HDFS-8652
Updating HADOOP-12185
Updating HDFS-8686

Mime
View raw message