hadoop-yarn-dev mailing list archives

Site index · List index
Message view « Date » · « Thread »
Top « Date » · « Thread »
From Apache Jenkins Server <jenk...@builds.apache.org>
Subject Failed: YARN-3948 PreCommit Build #8668
Date Sat, 25 Jul 2015 08:12:04 GMT
Jira: https://issues.apache.org/jira/browse/YARN-3948
Build: https://builds.apache.org/job/PreCommit-YARN-Build/8668/

###################################################################################
########################## LAST 60 LINES OF THE CONSOLE ###########################
[...truncated 406 lines...]
|      |                     |            | hadoop-yarn-server-resourcemanager.
|      |                     |  111m 30s  | 


             Reason | Tests
          FindBugs  |  module:hadoop-yarn-server-common 
 Failed unit tests  |  hadoop.yarn.server.resourcemanager.TestClientRMService 
                    |  hadoop.yarn.server.resourcemanager.rmapp.TestRMAppTransitions 


|| Subsystem || Report/Notes ||
============================================================================
| Patch URL | http://issues.apache.org/jira/secure/attachment/12747165/0002-YARN-3948.patch
|
| Optional Tests | javadoc javac unit findbugs checkstyle |
| git revision | trunk / adcf5dd |
| Pre-patch Findbugs warnings | /home/jenkins/jenkins-slave/workspace/PreCommit-YARN-Build/patchprocess/trunkFindbugsWarningshadoop-yarn-server-common.html
|
| checkstyle |  /home/jenkins/jenkins-slave/workspace/PreCommit-YARN-Build/patchprocess/diffcheckstylehadoop-yarn-api.txt
|
| whitespace | /home/jenkins/jenkins-slave/workspace/PreCommit-YARN-Build/patchprocess/whitespace.txt
|
| Findbugs warnings | /home/jenkins/jenkins-slave/workspace/PreCommit-YARN-Build/patchprocess/newPatchFindbugsWarningshadoop-yarn-server-common.html
|
| hadoop-yarn-api test log | /home/jenkins/jenkins-slave/workspace/PreCommit-YARN-Build/patchprocess/testrun_hadoop-yarn-api.txt
|
| hadoop-yarn-client test log | /home/jenkins/jenkins-slave/workspace/PreCommit-YARN-Build/patchprocess/testrun_hadoop-yarn-client.txt
|
| hadoop-yarn-common test log | /home/jenkins/jenkins-slave/workspace/PreCommit-YARN-Build/patchprocess/testrun_hadoop-yarn-common.txt
|
| hadoop-yarn-server-common test log | /home/jenkins/jenkins-slave/workspace/PreCommit-YARN-Build/patchprocess/testrun_hadoop-yarn-server-common.txt
|
| hadoop-yarn-server-resourcemanager test log | /home/jenkins/jenkins-slave/workspace/PreCommit-YARN-Build/patchprocess/testrun_hadoop-yarn-server-resourcemanager.txt
|
| Test Results | https://builds.apache.org/job/PreCommit-YARN-Build/8668/testReport/ |
| Java | 1.7.0_55 |
| uname | Linux asf906.gq1.ygridcore.net 3.13.0-36-lowlatency #63-Ubuntu SMP PREEMPT Wed Sep
3 21:56:12 UTC 2014 x86_64 x86_64 x86_64 GNU/Linux |


============================================================================
============================================================================
                          Adding comment to JIRA
============================================================================
============================================================================


Comment added.
f05b98b47fc141b950934c5aa978777c35abbb60 logged out


============================================================================
============================================================================
                              Finished build.
============================================================================
============================================================================


Build step 'Execute shell' marked build as failure
Archiving artifacts
Sending artifact delta relative to PreCommit-YARN-Build #8664
Archived 86 artifacts
Archive block size is 32768
Received 54 blocks and 31823784 bytes
Compression is 5.3%
Took 6.1 sec
[description-setter] Could not determine description.
Recording test results
Email was triggered for: Failure
Sending email for trigger: Failure



###################################################################################
############################## FAILED TESTS (if any) ##############################
6 tests failed.
FAILED:  org.apache.hadoop.yarn.server.resourcemanager.TestClientRMService.testAppSubmit

Error Message:
null

Stack Trace:
java.lang.NullPointerException: null
	at org.apache.hadoop.yarn.server.resourcemanager.rmapp.RMAppImpl.createAndGetApplicationReport(RMAppImpl.java:661)
	at org.apache.hadoop.yarn.server.resourcemanager.ClientRMService.getApplications(ClientRMService.java:810)
	at org.apache.hadoop.yarn.server.resourcemanager.ClientRMService.getApplications(ClientRMService.java:677)
	at org.apache.hadoop.yarn.server.resourcemanager.TestClientRMService.testAppSubmit(TestClientRMService.java:899)


FAILED:  org.apache.hadoop.yarn.server.resourcemanager.TestClientRMService.testGetApplications

Error Message:
null

Stack Trace:
java.lang.NullPointerException: null
	at org.apache.hadoop.yarn.server.resourcemanager.rmapp.RMAppImpl.createAndGetApplicationReport(RMAppImpl.java:661)
	at org.apache.hadoop.yarn.server.resourcemanager.ClientRMService.getApplications(ClientRMService.java:810)
	at org.apache.hadoop.yarn.server.resourcemanager.ClientRMService.getApplications(ClientRMService.java:677)
	at org.apache.hadoop.yarn.server.resourcemanager.TestClientRMService.testGetApplications(TestClientRMService.java:967)


FAILED:  org.apache.hadoop.yarn.server.resourcemanager.TestClientRMService.testGetQueueInfo

Error Message:
null

Stack Trace:
java.lang.NullPointerException: null
	at org.apache.hadoop.yarn.server.resourcemanager.rmapp.RMAppImpl.createAndGetApplicationReport(RMAppImpl.java:661)
	at org.apache.hadoop.yarn.server.resourcemanager.TestClientRMService$17.createAndGetApplicationReport(TestClientRMService.java:1234)
	at org.apache.hadoop.yarn.server.resourcemanager.ClientRMService.getQueueInfo(ClientRMService.java:871)
	at org.apache.hadoop.yarn.server.resourcemanager.TestClientRMService.testGetQueueInfo(TestClientRMService.java:575)


FAILED:  org.apache.hadoop.yarn.server.resourcemanager.TestClientRMService.testGetApplicationReport

Error Message:
null

Stack Trace:
java.lang.NullPointerException: null
	at org.apache.hadoop.yarn.server.resourcemanager.rmapp.RMAppImpl.createAndGetApplicationReport(RMAppImpl.java:661)
	at org.apache.hadoop.yarn.server.resourcemanager.TestClientRMService$17.createAndGetApplicationReport(TestClientRMService.java:1234)
	at org.apache.hadoop.yarn.server.resourcemanager.ClientRMService.getApplicationReport(ClientRMService.java:334)
	at org.apache.hadoop.yarn.server.resourcemanager.TestClientRMService.testGetApplicationReport(TestClientRMService.java:326)


FAILED:  org.apache.hadoop.yarn.server.resourcemanager.rmapp.TestRMAppTransitions.testGetAppReport[0]

Error Message:
null

Stack Trace:
java.lang.NullPointerException: null
	at org.apache.hadoop.yarn.server.resourcemanager.rmapp.RMAppImpl.createAndGetApplicationReport(RMAppImpl.java:661)
	at org.apache.hadoop.yarn.server.resourcemanager.rmapp.TestRMAppTransitions.testGetAppReport(TestRMAppTransitions.java:1010)


FAILED:  org.apache.hadoop.yarn.server.resourcemanager.rmapp.TestRMAppTransitions.testGetAppReport[1]

Error Message:
null

Stack Trace:
java.lang.NullPointerException: null
	at org.apache.hadoop.yarn.server.resourcemanager.rmapp.RMAppImpl.createAndGetApplicationReport(RMAppImpl.java:661)
	at org.apache.hadoop.yarn.server.resourcemanager.rmapp.TestRMAppTransitions.testGetAppReport(TestRMAppTransitions.java:1010)



Mime
  • Unnamed multipart/mixed (inline, None, 0 bytes)
View raw message