hadoop-yarn-dev mailing list archives

Site index · List index
Message view « Date » · « Thread »
Top « Date » · « Thread »
From Apache Jenkins Server <jenk...@builds.apache.org>
Subject Failed: YARN-3874 PreCommit Build #8601
Date Wed, 22 Jul 2015 01:32:19 GMT
Jira: https://issues.apache.org/jira/browse/YARN-3874
Build: https://builds.apache.org/job/PreCommit-YARN-Build/8601/

###################################################################################
########################## LAST 60 LINES OF THE CONSOLE ###########################
[...truncated 404 lines...]

             Reason | Tests
          FindBugs  |  module:hadoop-yarn-server-resourcemanager 
          FindBugs  |  module:hadoop-yarn-server-timelineservice 
 Failed unit tests  |  hadoop.yarn.server.resourcemanager.metrics.TestSystemMetricsPublisherForV2

                    |  hadoop.yarn.server.resourcemanager.applicationsmanager.TestAMRMRPCNodeUpdates

                    |  hadoop.yarn.server.resourcemanager.TestApplicationCleanup 
                    |  hadoop.yarn.server.resourcemanager.security.TestDelegationTokenRenewer

                    |  hadoop.yarn.server.resourcemanager.TestResourceTrackerService 
                    |  hadoop.yarn.server.resourcemanager.rmapp.TestRMAppTransitions 


|| Subsystem || Report/Notes ||
============================================================================
| Patch URL | http://issues.apache.org/jira/secure/attachment/12746423/YARN-3874-YARN-2928.02.patch
|
| Optional Tests | javac unit findbugs checkstyle javadoc |
| git revision | YARN-2928 / eb1932d |
| whitespace | /home/jenkins/jenkins-slave/workspace/PreCommit-YARN-Build/patchprocess/whitespace.txt
|
| Findbugs warnings | /home/jenkins/jenkins-slave/workspace/PreCommit-YARN-Build/patchprocess/newPatchFindbugsWarningshadoop-yarn-server-resourcemanager.html
|
| Findbugs warnings | /home/jenkins/jenkins-slave/workspace/PreCommit-YARN-Build/patchprocess/newPatchFindbugsWarningshadoop-yarn-server-timelineservice.html
|
| hadoop-mapreduce-client-jobclient test log | /home/jenkins/jenkins-slave/workspace/PreCommit-YARN-Build/patchprocess/testrun_hadoop-mapreduce-client-jobclient.txt
|
| hadoop-yarn-applications-distributedshell test log | /home/jenkins/jenkins-slave/workspace/PreCommit-YARN-Build/patchprocess/testrun_hadoop-yarn-applications-distributedshell.txt
|
| hadoop-yarn-server-resourcemanager test log | /home/jenkins/jenkins-slave/workspace/PreCommit-YARN-Build/patchprocess/testrun_hadoop-yarn-server-resourcemanager.txt
|
| hadoop-yarn-server-timelineservice test log | /home/jenkins/jenkins-slave/workspace/PreCommit-YARN-Build/patchprocess/testrun_hadoop-yarn-server-timelineservice.txt
|
| Test Results | https://builds.apache.org/job/PreCommit-YARN-Build/8601/testReport/ |
| Java | 1.7.0_55 |
| uname | Linux asf902.gq1.ygridcore.net 3.13.0-36-lowlatency #63-Ubuntu SMP PREEMPT Wed Sep
3 21:56:12 UTC 2014 x86_64 x86_64 x86_64 GNU/Linux |


============================================================================
============================================================================
                          Adding comment to JIRA
============================================================================
============================================================================


Comment added.
bb8301523d673b0c4e95b84453c0c418fb756c81 logged out


============================================================================
============================================================================
                              Finished build.
============================================================================
============================================================================


Build step 'Execute shell' marked build as failure
Archiving artifacts
Sending artifact delta relative to PreCommit-YARN-Build #8600
Archived 63 artifacts
Archive block size is 32768
Received 36 blocks and 9856716 bytes
Compression is 10.7%
Took 2.3 sec
[description-setter] Could not determine description.
Recording test results
Email was triggered for: Failure
Sending email for trigger: Failure



###################################################################################
############################## FAILED TESTS (if any) ##############################
12 tests failed.
FAILED:  org.apache.hadoop.yarn.server.resourcemanager.TestApplicationCleanup.testContainerCleanup

Error Message:
expected:<1> but was:<0>

Stack Trace:
java.lang.AssertionError: expected:<1> but was:<0>
	at org.junit.Assert.fail(Assert.java:88)
	at org.junit.Assert.failNotEquals(Assert.java:743)
	at org.junit.Assert.assertEquals(Assert.java:118)
	at org.junit.Assert.assertEquals(Assert.java:555)
	at org.junit.Assert.assertEquals(Assert.java:542)
	at org.apache.hadoop.yarn.server.resourcemanager.TestApplicationCleanup.waitForContainerCleanup(TestApplicationCleanup.java:278)
	at org.apache.hadoop.yarn.server.resourcemanager.TestApplicationCleanup.testContainerCleanup(TestApplicationCleanup.java:253)


FAILED:  org.apache.hadoop.yarn.server.resourcemanager.TestResourceTrackerService.testReconnectNode

Error Message:
expected:<10240> but was:<5120>

Stack Trace:
java.lang.AssertionError: expected:<10240> but was:<5120>
	at org.junit.Assert.fail(Assert.java:88)
	at org.junit.Assert.failNotEquals(Assert.java:743)
	at org.junit.Assert.assertEquals(Assert.java:118)
	at org.junit.Assert.assertEquals(Assert.java:555)
	at org.junit.Assert.assertEquals(Assert.java:542)
	at org.apache.hadoop.yarn.server.resourcemanager.TestResourceTrackerService.testReconnectNode(TestResourceTrackerService.java:1044)


FAILED:  org.apache.hadoop.yarn.server.resourcemanager.applicationsmanager.TestAMRMRPCNodeUpdates.testAMRMUnusableNodes

Error Message:
expected:<1> but was:<0>

Stack Trace:
java.lang.AssertionError: expected:<1> but was:<0>
	at org.junit.Assert.fail(Assert.java:88)
	at org.junit.Assert.failNotEquals(Assert.java:743)
	at org.junit.Assert.assertEquals(Assert.java:118)
	at org.junit.Assert.assertEquals(Assert.java:555)
	at org.junit.Assert.assertEquals(Assert.java:542)
	at org.apache.hadoop.yarn.server.resourcemanager.applicationsmanager.TestAMRMRPCNodeUpdates.testAMRMUnusableNodes(TestAMRMRPCNodeUpdates.java:156)


FAILED:  org.apache.hadoop.yarn.server.resourcemanager.metrics.TestSystemMetricsPublisherForV2.testPublishApplicationMetrics

Error Message:
null

Stack Trace:
java.lang.AssertionError: null
	at org.junit.Assert.fail(Assert.java:86)
	at org.junit.Assert.assertTrue(Assert.java:41)
	at org.junit.Assert.assertTrue(Assert.java:52)
	at org.apache.hadoop.yarn.server.resourcemanager.metrics.TestSystemMetricsPublisherForV2.testPublishApplicationMetrics(TestSystemMetricsPublisherForV2.java:194)


FAILED:  org.apache.hadoop.yarn.server.resourcemanager.metrics.TestSystemMetricsPublisherForV2.testPublishAppAttemptMetrics

Error Message:
null

Stack Trace:
java.lang.AssertionError: null
	at org.junit.Assert.fail(Assert.java:86)
	at org.junit.Assert.assertTrue(Assert.java:41)
	at org.junit.Assert.assertTrue(Assert.java:52)
	at org.apache.hadoop.yarn.server.resourcemanager.metrics.TestSystemMetricsPublisherForV2.testPublishAppAttemptMetrics(TestSystemMetricsPublisherForV2.java:229)


FAILED:  org.apache.hadoop.yarn.server.resourcemanager.metrics.TestSystemMetricsPublisherForV2.testPublishContainerMetrics

Error Message:
null

Stack Trace:
java.lang.AssertionError: null
	at org.junit.Assert.fail(Assert.java:86)
	at org.junit.Assert.assertTrue(Assert.java:41)
	at org.junit.Assert.assertTrue(Assert.java:52)
	at org.apache.hadoop.yarn.server.resourcemanager.metrics.TestSystemMetricsPublisherForV2.testPublishContainerMetrics(TestSystemMetricsPublisherForV2.java:261)


FAILED:  org.apache.hadoop.yarn.server.resourcemanager.rmapp.TestRMAppTransitions.testAppAcceptedAttemptKilled[0]

Error Message:
expected:<APP_REMOVED> but was:<APP_ATTEMPT_ADDED>

Stack Trace:
java.lang.AssertionError: expected:<APP_REMOVED> but was:<APP_ATTEMPT_ADDED>
	at org.junit.Assert.fail(Assert.java:88)
	at org.junit.Assert.failNotEquals(Assert.java:743)
	at org.junit.Assert.assertEquals(Assert.java:118)
	at org.junit.Assert.assertEquals(Assert.java:144)
	at org.apache.hadoop.yarn.server.resourcemanager.rmapp.TestRMAppTransitions.verifyAppRemovedSchedulerEvent(TestRMAppTransitions.java:1037)
	at org.apache.hadoop.yarn.server.resourcemanager.rmapp.TestRMAppTransitions.testAppAcceptedAttemptKilled(TestRMAppTransitions.java:747)


FAILED:  org.apache.hadoop.yarn.server.resourcemanager.rmapp.TestRMAppTransitions.testAppAcceptedAttemptKilled[1]

Error Message:
expected:<APP_REMOVED> but was:<APP_ATTEMPT_ADDED>

Stack Trace:
java.lang.AssertionError: expected:<APP_REMOVED> but was:<APP_ATTEMPT_ADDED>
	at org.junit.Assert.fail(Assert.java:88)
	at org.junit.Assert.failNotEquals(Assert.java:743)
	at org.junit.Assert.assertEquals(Assert.java:118)
	at org.junit.Assert.assertEquals(Assert.java:144)
	at org.apache.hadoop.yarn.server.resourcemanager.rmapp.TestRMAppTransitions.verifyAppRemovedSchedulerEvent(TestRMAppTransitions.java:1037)
	at org.apache.hadoop.yarn.server.resourcemanager.rmapp.TestRMAppTransitions.testAppAcceptedAttemptKilled(TestRMAppTransitions.java:747)


FAILED:  org.apache.hadoop.yarn.server.resourcemanager.security.TestDelegationTokenRenewer.testAppSubmissionWithPreviousToken

Error Message:
null

Stack Trace:
java.lang.NullPointerException: null
	at org.apache.hadoop.hdfs.DistributedFileSystem.getFileStatus(DistributedFileSystem.java:1277)
	at org.apache.hadoop.fs.FileSystem.exists(FileSystem.java:1428)
	at org.apache.hadoop.yarn.server.timelineservice.storage.FileSystemTimelineWriterImpl.serviceStart(FileSystemTimelineWriterImpl.java:198)
	at org.apache.hadoop.service.AbstractService.start(AbstractService.java:193)
	at org.apache.hadoop.yarn.server.timelineservice.collector.TimelineCollectorManager.serviceStart(TimelineCollectorManager.java:66)
	at org.apache.hadoop.service.AbstractService.start(AbstractService.java:193)
	at org.apache.hadoop.service.CompositeService.serviceStart(CompositeService.java:120)
	at org.apache.hadoop.yarn.server.resourcemanager.ResourceManager$RMActiveServices.serviceStart(ResourceManager.java:597)
	at org.apache.hadoop.service.AbstractService.start(AbstractService.java:193)
	at org.apache.hadoop.yarn.server.resourcemanager.ResourceManager.startActiveServices(ResourceManager.java:974)
	at org.apache.hadoop.yarn.server.resourcemanager.ResourceManager$1.run(ResourceManager.java:1015)
	at org.apache.hadoop.yarn.server.resourcemanager.ResourceManager$1.run(ResourceManager.java:1011)
	at java.security.AccessController.doPrivileged(Native Method)
	at javax.security.auth.Subject.doAs(Subject.java:415)
	at org.apache.hadoop.security.UserGroupInformation.doAs(UserGroupInformation.java:1666)
	at org.apache.hadoop.yarn.server.resourcemanager.ResourceManager.transitionToActive(ResourceManager.java:1011)
	at org.apache.hadoop.yarn.server.resourcemanager.ResourceManager.serviceStart(ResourceManager.java:1051)
	at org.apache.hadoop.service.AbstractService.start(AbstractService.java:193)
	at org.apache.hadoop.yarn.server.resourcemanager.security.TestDelegationTokenRenewer.testAppSubmissionWithPreviousToken(TestDelegationTokenRenewer.java:1030)


FAILED:  org.apache.hadoop.yarn.server.resourcemanager.security.TestDelegationTokenRenewer.testCancelWithMultipleAppSubmissions

Error Message:
null

Stack Trace:
java.lang.NullPointerException: null
	at org.apache.hadoop.hdfs.DistributedFileSystem.getFileStatus(DistributedFileSystem.java:1277)
	at org.apache.hadoop.fs.FileSystem.exists(FileSystem.java:1428)
	at org.apache.hadoop.yarn.server.timelineservice.storage.FileSystemTimelineWriterImpl.serviceStart(FileSystemTimelineWriterImpl.java:198)
	at org.apache.hadoop.service.AbstractService.start(AbstractService.java:193)
	at org.apache.hadoop.yarn.server.timelineservice.collector.TimelineCollectorManager.serviceStart(TimelineCollectorManager.java:66)
	at org.apache.hadoop.service.AbstractService.start(AbstractService.java:193)
	at org.apache.hadoop.service.CompositeService.serviceStart(CompositeService.java:120)
	at org.apache.hadoop.yarn.server.resourcemanager.ResourceManager$RMActiveServices.serviceStart(ResourceManager.java:597)
	at org.apache.hadoop.service.AbstractService.start(AbstractService.java:193)
	at org.apache.hadoop.yarn.server.resourcemanager.ResourceManager.startActiveServices(ResourceManager.java:974)
	at org.apache.hadoop.yarn.server.resourcemanager.ResourceManager$1.run(ResourceManager.java:1015)
	at org.apache.hadoop.yarn.server.resourcemanager.ResourceManager$1.run(ResourceManager.java:1011)
	at java.security.AccessController.doPrivileged(Native Method)
	at javax.security.auth.Subject.doAs(Subject.java:415)
	at org.apache.hadoop.security.UserGroupInformation.doAs(UserGroupInformation.java:1666)
	at org.apache.hadoop.yarn.server.resourcemanager.ResourceManager.transitionToActive(ResourceManager.java:1011)
	at org.apache.hadoop.yarn.server.resourcemanager.ResourceManager.serviceStart(ResourceManager.java:1051)
	at org.apache.hadoop.service.AbstractService.start(AbstractService.java:193)
	at org.apache.hadoop.yarn.server.resourcemanager.security.TestDelegationTokenRenewer.testCancelWithMultipleAppSubmissions(TestDelegationTokenRenewer.java:1088)


FAILED:  org.apache.hadoop.yarn.server.resourcemanager.security.TestDelegationTokenRenewer.testReplaceExpiringDelegationToken

Error Message:
null

Stack Trace:
java.lang.NullPointerException: null
	at org.apache.hadoop.hdfs.DistributedFileSystem.getFileStatus(DistributedFileSystem.java:1277)
	at org.apache.hadoop.fs.FileSystem.exists(FileSystem.java:1428)
	at org.apache.hadoop.yarn.server.timelineservice.storage.FileSystemTimelineWriterImpl.serviceStart(FileSystemTimelineWriterImpl.java:198)
	at org.apache.hadoop.service.AbstractService.start(AbstractService.java:193)
	at org.apache.hadoop.yarn.server.timelineservice.collector.TimelineCollectorManager.serviceStart(TimelineCollectorManager.java:66)
	at org.apache.hadoop.service.AbstractService.start(AbstractService.java:193)
	at org.apache.hadoop.service.CompositeService.serviceStart(CompositeService.java:120)
	at org.apache.hadoop.yarn.server.resourcemanager.ResourceManager$RMActiveServices.serviceStart(ResourceManager.java:597)
	at org.apache.hadoop.service.AbstractService.start(AbstractService.java:193)
	at org.apache.hadoop.yarn.server.resourcemanager.ResourceManager.startActiveServices(ResourceManager.java:974)
	at org.apache.hadoop.yarn.server.resourcemanager.ResourceManager$1.run(ResourceManager.java:1015)
	at org.apache.hadoop.yarn.server.resourcemanager.ResourceManager$1.run(ResourceManager.java:1011)
	at java.security.AccessController.doPrivileged(Native Method)
	at javax.security.auth.Subject.doAs(Subject.java:415)
	at org.apache.hadoop.security.UserGroupInformation.doAs(UserGroupInformation.java:1666)
	at org.apache.hadoop.yarn.server.resourcemanager.ResourceManager.transitionToActive(ResourceManager.java:1011)
	at org.apache.hadoop.yarn.server.resourcemanager.ResourceManager.serviceStart(ResourceManager.java:1051)
	at org.apache.hadoop.service.AbstractService.start(AbstractService.java:193)
	at org.apache.hadoop.yarn.server.resourcemanager.security.TestDelegationTokenRenewer.testReplaceExpiringDelegationToken(TestDelegationTokenRenewer.java:921)


FAILED:  org.apache.hadoop.yarn.server.resourcemanager.security.TestDelegationTokenRenewer.testAppSubmissionWithoutDelegationToken

Error Message:
null

Stack Trace:
java.lang.NullPointerException: null
	at org.apache.hadoop.hdfs.DistributedFileSystem.getFileStatus(DistributedFileSystem.java:1277)
	at org.apache.hadoop.fs.FileSystem.exists(FileSystem.java:1428)
	at org.apache.hadoop.yarn.server.timelineservice.storage.FileSystemTimelineWriterImpl.serviceStart(FileSystemTimelineWriterImpl.java:198)
	at org.apache.hadoop.service.AbstractService.start(AbstractService.java:193)
	at org.apache.hadoop.yarn.server.timelineservice.collector.TimelineCollectorManager.serviceStart(TimelineCollectorManager.java:66)
	at org.apache.hadoop.service.AbstractService.start(AbstractService.java:193)
	at org.apache.hadoop.service.CompositeService.serviceStart(CompositeService.java:120)
	at org.apache.hadoop.yarn.server.resourcemanager.ResourceManager$RMActiveServices.serviceStart(ResourceManager.java:597)
	at org.apache.hadoop.service.AbstractService.start(AbstractService.java:193)
	at org.apache.hadoop.yarn.server.resourcemanager.ResourceManager.startActiveServices(ResourceManager.java:974)
	at org.apache.hadoop.yarn.server.resourcemanager.ResourceManager$1.run(ResourceManager.java:1015)
	at org.apache.hadoop.yarn.server.resourcemanager.ResourceManager$1.run(ResourceManager.java:1011)
	at java.security.AccessController.doPrivileged(Native Method)
	at javax.security.auth.Subject.doAs(Subject.java:415)
	at org.apache.hadoop.security.UserGroupInformation.doAs(UserGroupInformation.java:1666)
	at org.apache.hadoop.yarn.server.resourcemanager.ResourceManager.transitionToActive(ResourceManager.java:1011)
	at org.apache.hadoop.yarn.server.resourcemanager.ResourceManager.serviceStart(ResourceManager.java:1051)
	at org.apache.hadoop.service.AbstractService.start(AbstractService.java:193)
	at org.apache.hadoop.yarn.server.resourcemanager.security.TestDelegationTokenRenewer.testAppSubmissionWithoutDelegationToken(TestDelegationTokenRenewer.java:996)



Mime
  • Unnamed multipart/mixed (inline, None, 0 bytes)
View raw message