hadoop-yarn-dev mailing list archives

Site index · List index
Message view « Date » · « Thread »
Top « Date » · « Thread »
From Apache Jenkins Server <jenk...@builds.apache.org>
Subject Hadoop-Yarn-trunk-Java8 - Build # 221 - Still Failing
Date Sun, 07 Jun 2015 11:37:05 GMT
See https://builds.apache.org/job/Hadoop-Yarn-trunk-Java8/221/

###################################################################################
########################## LAST 60 LINES OF THE CONSOLE ###########################
[...truncated 5096 lines...]
Tests run: 4, Failures: 0, Errors: 0, Skipped: 0, Time elapsed: 12.598 sec - in org.apache.hadoop.yarn.server.resourcemanager.TestAMAuthorization

Results :

Failed tests: 
  TestWorkPreservingRMRestart.testSchedulerRecovery:240->checkFSQueue:341->assertMetrics:852
expected:<6144> but was:<8192>

Tests run: 1111, Failures: 1, Errors: 0, Skipped: 1

[INFO] ------------------------------------------------------------------------
[INFO] Reactor Summary:
[INFO] 
[INFO] Apache Hadoop YARN ................................ SUCCESS [  3.076 s]
[INFO] Apache Hadoop YARN API ............................ SUCCESS [01:16 min]
[INFO] Apache Hadoop YARN Common ......................... SUCCESS [02:28 min]
[INFO] Apache Hadoop YARN Server ......................... SUCCESS [  0.069 s]
[INFO] Apache Hadoop YARN Server Common .................. SUCCESS [ 36.598 s]
[INFO] Apache Hadoop YARN NodeManager .................... SUCCESS [06:26 min]
[INFO] Apache Hadoop YARN Web Proxy ...................... SUCCESS [ 15.085 s]
[INFO] Apache Hadoop YARN ApplicationHistoryService ...... SUCCESS [03:06 min]
[INFO] Apache Hadoop YARN ResourceManager ................ FAILURE [50:30 min]
[INFO] Apache Hadoop YARN Server Tests ................... SKIPPED
[INFO] Apache Hadoop YARN Client ......................... SKIPPED
[INFO] Apache Hadoop YARN SharedCacheManager ............. SKIPPED
[INFO] Apache Hadoop YARN Applications ................... SKIPPED
[INFO] Apache Hadoop YARN DistributedShell ............... SKIPPED
[INFO] Apache Hadoop YARN Unmanaged Am Launcher .......... SKIPPED
[INFO] Apache Hadoop YARN Site ........................... SKIPPED
[INFO] Apache Hadoop YARN Registry ....................... SKIPPED
[INFO] Apache Hadoop YARN Project ........................ SKIPPED
[INFO] ------------------------------------------------------------------------
[INFO] BUILD FAILURE
[INFO] ------------------------------------------------------------------------
[INFO] Total time: 01:04 h
[INFO] Finished at: 2015-06-07T11:36:57+00:00
[INFO] Final Memory: 63M/1007M
[INFO] ------------------------------------------------------------------------
[ERROR] Failed to execute goal org.apache.maven.plugins:maven-surefire-plugin:2.17:test (default-test)
on project hadoop-yarn-server-resourcemanager: There are test failures.
[ERROR] 
[ERROR] Please refer to /home/jenkins/jenkins-slave/workspace/Hadoop-Yarn-trunk-Java8/hadoop-yarn-project/hadoop-yarn/hadoop-yarn-server/hadoop-yarn-server-resourcemanager/target/surefire-reports
for the individual test results.
[ERROR] -> [Help 1]
[ERROR] 
[ERROR] To see the full stack trace of the errors, re-run Maven with the -e switch.
[ERROR] Re-run Maven using the -X switch to enable full debug logging.
[ERROR] 
[ERROR] For more information about the errors and possible solutions, please read the following
articles:
[ERROR] [Help 1] http://cwiki.apache.org/confluence/display/MAVEN/MojoFailureException
[ERROR] 
[ERROR] After correcting the problems, you can resume the build with the command
[ERROR]   mvn <goals> -rf :hadoop-yarn-server-resourcemanager
Build step 'Execute shell' marked build as failure
Archiving artifacts
Recording test results
Updating HDFS-8116
Updating HADOOP-12055
Updating HDFS-8432
Sending e-mails to: yarn-dev@hadoop.apache.org
Email was triggered for: Failure
Sending email for trigger: Failure



###################################################################################
############################## FAILED TESTS (if any) ##############################
1 tests failed.
FAILED:  org.apache.hadoop.yarn.server.resourcemanager.TestWorkPreservingRMRestart.testSchedulerRecovery[1]

Error Message:
expected:<6144> but was:<8192>

Stack Trace:
java.lang.AssertionError: expected:<6144> but was:<8192>
	at org.junit.Assert.fail(Assert.java:88)
	at org.junit.Assert.failNotEquals(Assert.java:743)
	at org.junit.Assert.assertEquals(Assert.java:118)
	at org.junit.Assert.assertEquals(Assert.java:555)
	at org.junit.Assert.assertEquals(Assert.java:542)
	at org.apache.hadoop.yarn.server.resourcemanager.TestWorkPreservingRMRestart.assertMetrics(TestWorkPreservingRMRestart.java:852)
	at org.apache.hadoop.yarn.server.resourcemanager.TestWorkPreservingRMRestart.checkFSQueue(TestWorkPreservingRMRestart.java:341)
	at org.apache.hadoop.yarn.server.resourcemanager.TestWorkPreservingRMRestart.testSchedulerRecovery(TestWorkPreservingRMRestart.java:240)



Mime
  • Unnamed multipart/mixed (inline, None, 0 bytes)
View raw message