hadoop-yarn-dev mailing list archives

Site index · List index
Message view « Date » · « Thread »
Top « Date » · « Thread »
From Apache Jenkins Server <jenk...@builds.apache.org>
Subject Hadoop-Yarn-trunk - Build # 953 - Failure
Date Tue, 09 Jun 2015 10:49:33 GMT
See https://builds.apache.org/job/Hadoop-Yarn-trunk/953/

###################################################################################
########################## LAST 60 LINES OF THE CONSOLE ###########################
[...truncated 8596 lines...]
[INFO] Reactor Summary:
[INFO] 
[INFO] Apache Hadoop YARN ................................ SUCCESS [  3.717 s]
[INFO] Apache Hadoop YARN API ............................ SUCCESS [03:35 min]
[INFO] Apache Hadoop YARN Common ......................... SUCCESS [02:54 min]
[INFO] Apache Hadoop YARN Server ......................... SUCCESS [  0.088 s]
[INFO] Apache Hadoop YARN Server Common .................. SUCCESS [ 43.639 s]
[INFO] Apache Hadoop YARN NodeManager .................... SUCCESS [06:28 min]
[INFO] Apache Hadoop YARN Web Proxy ...................... SUCCESS [ 23.438 s]
[INFO] Apache Hadoop YARN ApplicationHistoryService ...... FAILURE [02:31 min]
[INFO] Apache Hadoop YARN ResourceManager ................ SKIPPED
[INFO] Apache Hadoop YARN Server Tests ................... SKIPPED
[INFO] Apache Hadoop YARN Client ......................... SKIPPED
[INFO] Apache Hadoop YARN SharedCacheManager ............. SKIPPED
[INFO] Apache Hadoop YARN Applications ................... SKIPPED
[INFO] Apache Hadoop YARN DistributedShell ............... SKIPPED
[INFO] Apache Hadoop YARN Unmanaged Am Launcher .......... SKIPPED
[INFO] Apache Hadoop YARN Site ........................... SKIPPED
[INFO] Apache Hadoop YARN Registry ....................... SKIPPED
[INFO] Apache Hadoop YARN Project ........................ SKIPPED
[INFO] ------------------------------------------------------------------------
[INFO] BUILD FAILURE
[INFO] ------------------------------------------------------------------------
[INFO] Total time: 16:42 min
[INFO] Finished at: 2015-06-09T10:49:16+00:00
[INFO] Final Memory: 83M/1088M
[INFO] ------------------------------------------------------------------------
[ERROR] Failed to execute goal org.apache.maven.plugins:maven-surefire-plugin:2.17:test (default-test)
on project hadoop-yarn-server-applicationhistoryservice: There are test failures.
[ERROR] 
[ERROR] Please refer to /home/jenkins/jenkins-slave/workspace/Hadoop-Yarn-trunk/hadoop-yarn-project/hadoop-yarn/hadoop-yarn-server/hadoop-yarn-server-applicationhistoryservice/target/surefire-reports
for the individual test results.
[ERROR] -> [Help 1]
[ERROR] 
[ERROR] To see the full stack trace of the errors, re-run Maven with the -e switch.
[ERROR] Re-run Maven using the -X switch to enable full debug logging.
[ERROR] 
[ERROR] For more information about the errors and possible solutions, please read the following
articles:
[ERROR] [Help 1] http://cwiki.apache.org/confluence/display/MAVEN/MojoFailureException
[ERROR] 
[ERROR] After correcting the problems, you can resume the build with the command
[ERROR]   mvn <goals> -rf :hadoop-yarn-server-applicationhistoryservice
Build step 'Execute shell' marked build as failure
Archiving artifacts
Recording test results
Updating YARN-3787
Updating HDFS-8552
Updating HADOOP-12073
Updating MAPREDUCE-6392
Updating YARN-3786
Updating HDFS-8553
Updating YARN-3778
Updating HADOOP-11347
Updating HDFS-8554
Updating YARN-2716
Updating HADOOP-12054
Updating MAPREDUCE-6388
Updating HADOOP-12052
Sending e-mails to: yarn-dev@hadoop.apache.org
Email was triggered for: Failure
Sending email for trigger: Failure



###################################################################################
############################## FAILED TESTS (if any) ##############################
18 tests failed.
REGRESSION:  org.apache.hadoop.yarn.server.timeline.TestRollingLevelDB.testInsertForPreviousPeriodAfterRollPeriodRollsDB

Error Message:
null

Stack Trace:
java.lang.UnsupportedOperationException: null
	at org.apache.hadoop.fs.permission.FsPermission$ImmutableFsPermission.applyUMask(FsPermission.java:380)
	at org.apache.hadoop.fs.RawLocalFileSystem.mkOneDirWithMode(RawLocalFileSystem.java:496)
	at org.apache.hadoop.fs.RawLocalFileSystem.mkdirsWithOptionalPermission(RawLocalFileSystem.java:551)
	at org.apache.hadoop.fs.RawLocalFileSystem.mkdirs(RawLocalFileSystem.java:529)
	at org.apache.hadoop.fs.FilterFileSystem.mkdirs(FilterFileSystem.java:314)
	at org.apache.hadoop.yarn.server.timeline.RollingLevelDB.initFileSystem(RollingLevelDB.java:207)
	at org.apache.hadoop.yarn.server.timeline.RollingLevelDB.init(RollingLevelDB.java:200)
	at org.apache.hadoop.yarn.server.timeline.TestRollingLevelDB$MyRollingLevelDB.init(TestRollingLevelDB.java:38)
	at org.apache.hadoop.yarn.server.timeline.TestRollingLevelDB.testInsertForPreviousPeriodAfterRollPeriodRollsDB(TestRollingLevelDB.java:90)


REGRESSION:  org.apache.hadoop.yarn.server.timeline.TestRollingLevelDB.testInsertAfterRollPeriodRollsDB

Error Message:
null

Stack Trace:
java.lang.UnsupportedOperationException: null
	at org.apache.hadoop.fs.permission.FsPermission$ImmutableFsPermission.applyUMask(FsPermission.java:380)
	at org.apache.hadoop.fs.RawLocalFileSystem.mkOneDirWithMode(RawLocalFileSystem.java:496)
	at org.apache.hadoop.fs.RawLocalFileSystem.mkdirsWithOptionalPermission(RawLocalFileSystem.java:551)
	at org.apache.hadoop.fs.RawLocalFileSystem.mkdirs(RawLocalFileSystem.java:529)
	at org.apache.hadoop.fs.FilterFileSystem.mkdirs(FilterFileSystem.java:314)
	at org.apache.hadoop.yarn.server.timeline.RollingLevelDB.initFileSystem(RollingLevelDB.java:207)
	at org.apache.hadoop.yarn.server.timeline.RollingLevelDB.init(RollingLevelDB.java:200)
	at org.apache.hadoop.yarn.server.timeline.TestRollingLevelDB$MyRollingLevelDB.init(TestRollingLevelDB.java:38)
	at org.apache.hadoop.yarn.server.timeline.TestRollingLevelDB.testInsertAfterRollPeriodRollsDB(TestRollingLevelDB.java:70)


REGRESSION:  org.apache.hadoop.yarn.server.timeline.TestRollingLevelDBTimelineStore.testGetDomains

Error Message:
null

Stack Trace:
java.lang.UnsupportedOperationException: null
	at org.apache.hadoop.fs.permission.FsPermission$ImmutableFsPermission.applyUMask(FsPermission.java:380)
	at org.apache.hadoop.fs.RawLocalFileSystem.mkOneDirWithMode(RawLocalFileSystem.java:496)
	at org.apache.hadoop.fs.RawLocalFileSystem.mkdirsWithOptionalPermission(RawLocalFileSystem.java:551)
	at org.apache.hadoop.fs.RawLocalFileSystem.mkdirs(RawLocalFileSystem.java:529)
	at org.apache.hadoop.fs.FilterFileSystem.mkdirs(FilterFileSystem.java:314)
	at org.apache.hadoop.yarn.server.timeline.RollingLevelDB.initFileSystem(RollingLevelDB.java:207)
	at org.apache.hadoop.yarn.server.timeline.RollingLevelDB.init(RollingLevelDB.java:200)
	at org.apache.hadoop.yarn.server.timeline.RollingLevelDBTimelineStore.serviceInit(RollingLevelDBTimelineStore.java:321)
	at org.apache.hadoop.service.AbstractService.init(AbstractService.java:163)
	at org.apache.hadoop.yarn.server.timeline.TestRollingLevelDBTimelineStore.setup(TestRollingLevelDBTimelineStore.java:65)


REGRESSION:  org.apache.hadoop.yarn.server.timeline.TestRollingLevelDBTimelineStore.testRelatingToNonExistingEntity

Error Message:
null

Stack Trace:
java.lang.UnsupportedOperationException: null
	at org.apache.hadoop.fs.permission.FsPermission$ImmutableFsPermission.applyUMask(FsPermission.java:380)
	at org.apache.hadoop.fs.RawLocalFileSystem.mkOneDirWithMode(RawLocalFileSystem.java:496)
	at org.apache.hadoop.fs.RawLocalFileSystem.mkdirsWithOptionalPermission(RawLocalFileSystem.java:551)
	at org.apache.hadoop.fs.RawLocalFileSystem.mkdirs(RawLocalFileSystem.java:529)
	at org.apache.hadoop.fs.FilterFileSystem.mkdirs(FilterFileSystem.java:314)
	at org.apache.hadoop.yarn.server.timeline.RollingLevelDB.initFileSystem(RollingLevelDB.java:207)
	at org.apache.hadoop.yarn.server.timeline.RollingLevelDB.init(RollingLevelDB.java:200)
	at org.apache.hadoop.yarn.server.timeline.RollingLevelDBTimelineStore.serviceInit(RollingLevelDBTimelineStore.java:321)
	at org.apache.hadoop.service.AbstractService.init(AbstractService.java:163)
	at org.apache.hadoop.yarn.server.timeline.TestRollingLevelDBTimelineStore.setup(TestRollingLevelDBTimelineStore.java:65)


REGRESSION:  org.apache.hadoop.yarn.server.timeline.TestRollingLevelDBTimelineStore.testValidateConfig

Error Message:
null

Stack Trace:
java.lang.UnsupportedOperationException: null
	at org.apache.hadoop.fs.permission.FsPermission$ImmutableFsPermission.applyUMask(FsPermission.java:380)
	at org.apache.hadoop.fs.RawLocalFileSystem.mkOneDirWithMode(RawLocalFileSystem.java:496)
	at org.apache.hadoop.fs.RawLocalFileSystem.mkdirsWithOptionalPermission(RawLocalFileSystem.java:551)
	at org.apache.hadoop.fs.RawLocalFileSystem.mkdirs(RawLocalFileSystem.java:529)
	at org.apache.hadoop.fs.FilterFileSystem.mkdirs(FilterFileSystem.java:314)
	at org.apache.hadoop.yarn.server.timeline.RollingLevelDB.initFileSystem(RollingLevelDB.java:207)
	at org.apache.hadoop.yarn.server.timeline.RollingLevelDB.init(RollingLevelDB.java:200)
	at org.apache.hadoop.yarn.server.timeline.RollingLevelDBTimelineStore.serviceInit(RollingLevelDBTimelineStore.java:321)
	at org.apache.hadoop.service.AbstractService.init(AbstractService.java:163)
	at org.apache.hadoop.yarn.server.timeline.TestRollingLevelDBTimelineStore.setup(TestRollingLevelDBTimelineStore.java:65)


REGRESSION:  org.apache.hadoop.yarn.server.timeline.TestRollingLevelDBTimelineStore.testGetEntitiesWithPrimaryFilters

Error Message:
null

Stack Trace:
java.lang.UnsupportedOperationException: null
	at org.apache.hadoop.fs.permission.FsPermission$ImmutableFsPermission.applyUMask(FsPermission.java:380)
	at org.apache.hadoop.fs.RawLocalFileSystem.mkOneDirWithMode(RawLocalFileSystem.java:496)
	at org.apache.hadoop.fs.RawLocalFileSystem.mkdirsWithOptionalPermission(RawLocalFileSystem.java:551)
	at org.apache.hadoop.fs.RawLocalFileSystem.mkdirs(RawLocalFileSystem.java:529)
	at org.apache.hadoop.fs.FilterFileSystem.mkdirs(FilterFileSystem.java:314)
	at org.apache.hadoop.yarn.server.timeline.RollingLevelDB.initFileSystem(RollingLevelDB.java:207)
	at org.apache.hadoop.yarn.server.timeline.RollingLevelDB.init(RollingLevelDB.java:200)
	at org.apache.hadoop.yarn.server.timeline.RollingLevelDBTimelineStore.serviceInit(RollingLevelDBTimelineStore.java:321)
	at org.apache.hadoop.service.AbstractService.init(AbstractService.java:163)
	at org.apache.hadoop.yarn.server.timeline.TestRollingLevelDBTimelineStore.setup(TestRollingLevelDBTimelineStore.java:65)


REGRESSION:  org.apache.hadoop.yarn.server.timeline.TestRollingLevelDBTimelineStore.testRelatingToOldEntityWithoutDomainId

Error Message:
null

Stack Trace:
java.lang.UnsupportedOperationException: null
	at org.apache.hadoop.fs.permission.FsPermission$ImmutableFsPermission.applyUMask(FsPermission.java:380)
	at org.apache.hadoop.fs.RawLocalFileSystem.mkOneDirWithMode(RawLocalFileSystem.java:496)
	at org.apache.hadoop.fs.RawLocalFileSystem.mkdirsWithOptionalPermission(RawLocalFileSystem.java:551)
	at org.apache.hadoop.fs.RawLocalFileSystem.mkdirs(RawLocalFileSystem.java:529)
	at org.apache.hadoop.fs.FilterFileSystem.mkdirs(FilterFileSystem.java:314)
	at org.apache.hadoop.yarn.server.timeline.RollingLevelDB.initFileSystem(RollingLevelDB.java:207)
	at org.apache.hadoop.yarn.server.timeline.RollingLevelDB.init(RollingLevelDB.java:200)
	at org.apache.hadoop.yarn.server.timeline.RollingLevelDBTimelineStore.serviceInit(RollingLevelDBTimelineStore.java:321)
	at org.apache.hadoop.service.AbstractService.init(AbstractService.java:163)
	at org.apache.hadoop.yarn.server.timeline.TestRollingLevelDBTimelineStore.setup(TestRollingLevelDBTimelineStore.java:65)


REGRESSION:  org.apache.hadoop.yarn.server.timeline.TestRollingLevelDBTimelineStore.testRootDirPermission

Error Message:
null

Stack Trace:
java.lang.UnsupportedOperationException: null
	at org.apache.hadoop.fs.permission.FsPermission$ImmutableFsPermission.applyUMask(FsPermission.java:380)
	at org.apache.hadoop.fs.RawLocalFileSystem.mkOneDirWithMode(RawLocalFileSystem.java:496)
	at org.apache.hadoop.fs.RawLocalFileSystem.mkdirsWithOptionalPermission(RawLocalFileSystem.java:551)
	at org.apache.hadoop.fs.RawLocalFileSystem.mkdirs(RawLocalFileSystem.java:529)
	at org.apache.hadoop.fs.FilterFileSystem.mkdirs(FilterFileSystem.java:314)
	at org.apache.hadoop.yarn.server.timeline.RollingLevelDB.initFileSystem(RollingLevelDB.java:207)
	at org.apache.hadoop.yarn.server.timeline.RollingLevelDB.init(RollingLevelDB.java:200)
	at org.apache.hadoop.yarn.server.timeline.RollingLevelDBTimelineStore.serviceInit(RollingLevelDBTimelineStore.java:321)
	at org.apache.hadoop.service.AbstractService.init(AbstractService.java:163)
	at org.apache.hadoop.yarn.server.timeline.TestRollingLevelDBTimelineStore.setup(TestRollingLevelDBTimelineStore.java:65)


REGRESSION:  org.apache.hadoop.yarn.server.timeline.TestRollingLevelDBTimelineStore.testGetSingleEntity

Error Message:
null

Stack Trace:
java.lang.UnsupportedOperationException: null
	at org.apache.hadoop.fs.permission.FsPermission$ImmutableFsPermission.applyUMask(FsPermission.java:380)
	at org.apache.hadoop.fs.RawLocalFileSystem.mkOneDirWithMode(RawLocalFileSystem.java:496)
	at org.apache.hadoop.fs.RawLocalFileSystem.mkdirsWithOptionalPermission(RawLocalFileSystem.java:551)
	at org.apache.hadoop.fs.RawLocalFileSystem.mkdirs(RawLocalFileSystem.java:529)
	at org.apache.hadoop.fs.FilterFileSystem.mkdirs(FilterFileSystem.java:314)
	at org.apache.hadoop.yarn.server.timeline.RollingLevelDB.initFileSystem(RollingLevelDB.java:207)
	at org.apache.hadoop.yarn.server.timeline.RollingLevelDB.init(RollingLevelDB.java:200)
	at org.apache.hadoop.yarn.server.timeline.RollingLevelDBTimelineStore.serviceInit(RollingLevelDBTimelineStore.java:321)
	at org.apache.hadoop.service.AbstractService.init(AbstractService.java:163)
	at org.apache.hadoop.yarn.server.timeline.TestRollingLevelDBTimelineStore.setup(TestRollingLevelDBTimelineStore.java:65)


REGRESSION:  org.apache.hadoop.yarn.server.timeline.TestRollingLevelDBTimelineStore.testCacheSizes

Error Message:
null

Stack Trace:
java.lang.UnsupportedOperationException: null
	at org.apache.hadoop.fs.permission.FsPermission$ImmutableFsPermission.applyUMask(FsPermission.java:380)
	at org.apache.hadoop.fs.RawLocalFileSystem.mkOneDirWithMode(RawLocalFileSystem.java:496)
	at org.apache.hadoop.fs.RawLocalFileSystem.mkdirsWithOptionalPermission(RawLocalFileSystem.java:551)
	at org.apache.hadoop.fs.RawLocalFileSystem.mkdirs(RawLocalFileSystem.java:529)
	at org.apache.hadoop.fs.FilterFileSystem.mkdirs(FilterFileSystem.java:314)
	at org.apache.hadoop.yarn.server.timeline.RollingLevelDB.initFileSystem(RollingLevelDB.java:207)
	at org.apache.hadoop.yarn.server.timeline.RollingLevelDB.init(RollingLevelDB.java:200)
	at org.apache.hadoop.yarn.server.timeline.RollingLevelDBTimelineStore.serviceInit(RollingLevelDBTimelineStore.java:321)
	at org.apache.hadoop.service.AbstractService.init(AbstractService.java:163)
	at org.apache.hadoop.yarn.server.timeline.TestRollingLevelDBTimelineStore.setup(TestRollingLevelDBTimelineStore.java:65)


REGRESSION:  org.apache.hadoop.yarn.server.timeline.TestRollingLevelDBTimelineStore.testGetEntities

Error Message:
null

Stack Trace:
java.lang.UnsupportedOperationException: null
	at org.apache.hadoop.fs.permission.FsPermission$ImmutableFsPermission.applyUMask(FsPermission.java:380)
	at org.apache.hadoop.fs.RawLocalFileSystem.mkOneDirWithMode(RawLocalFileSystem.java:496)
	at org.apache.hadoop.fs.RawLocalFileSystem.mkdirsWithOptionalPermission(RawLocalFileSystem.java:551)
	at org.apache.hadoop.fs.RawLocalFileSystem.mkdirs(RawLocalFileSystem.java:529)
	at org.apache.hadoop.fs.FilterFileSystem.mkdirs(FilterFileSystem.java:314)
	at org.apache.hadoop.yarn.server.timeline.RollingLevelDB.initFileSystem(RollingLevelDB.java:207)
	at org.apache.hadoop.yarn.server.timeline.RollingLevelDB.init(RollingLevelDB.java:200)
	at org.apache.hadoop.yarn.server.timeline.RollingLevelDBTimelineStore.serviceInit(RollingLevelDBTimelineStore.java:321)
	at org.apache.hadoop.service.AbstractService.init(AbstractService.java:163)
	at org.apache.hadoop.yarn.server.timeline.TestRollingLevelDBTimelineStore.setup(TestRollingLevelDBTimelineStore.java:65)


REGRESSION:  org.apache.hadoop.yarn.server.timeline.TestRollingLevelDBTimelineStore.testRelatingToEntityInSamePut

Error Message:
null

Stack Trace:
java.lang.UnsupportedOperationException: null
	at org.apache.hadoop.fs.permission.FsPermission$ImmutableFsPermission.applyUMask(FsPermission.java:380)
	at org.apache.hadoop.fs.RawLocalFileSystem.mkOneDirWithMode(RawLocalFileSystem.java:496)
	at org.apache.hadoop.fs.RawLocalFileSystem.mkdirsWithOptionalPermission(RawLocalFileSystem.java:551)
	at org.apache.hadoop.fs.RawLocalFileSystem.mkdirs(RawLocalFileSystem.java:529)
	at org.apache.hadoop.fs.FilterFileSystem.mkdirs(FilterFileSystem.java:314)
	at org.apache.hadoop.yarn.server.timeline.RollingLevelDB.initFileSystem(RollingLevelDB.java:207)
	at org.apache.hadoop.yarn.server.timeline.RollingLevelDB.init(RollingLevelDB.java:200)
	at org.apache.hadoop.yarn.server.timeline.RollingLevelDBTimelineStore.serviceInit(RollingLevelDBTimelineStore.java:321)
	at org.apache.hadoop.service.AbstractService.init(AbstractService.java:163)
	at org.apache.hadoop.yarn.server.timeline.TestRollingLevelDBTimelineStore.setup(TestRollingLevelDBTimelineStore.java:65)


REGRESSION:  org.apache.hadoop.yarn.server.timeline.TestRollingLevelDBTimelineStore.testGetDomain

Error Message:
null

Stack Trace:
java.lang.UnsupportedOperationException: null
	at org.apache.hadoop.fs.permission.FsPermission$ImmutableFsPermission.applyUMask(FsPermission.java:380)
	at org.apache.hadoop.fs.RawLocalFileSystem.mkOneDirWithMode(RawLocalFileSystem.java:496)
	at org.apache.hadoop.fs.RawLocalFileSystem.mkdirsWithOptionalPermission(RawLocalFileSystem.java:551)
	at org.apache.hadoop.fs.RawLocalFileSystem.mkdirs(RawLocalFileSystem.java:529)
	at org.apache.hadoop.fs.FilterFileSystem.mkdirs(FilterFileSystem.java:314)
	at org.apache.hadoop.yarn.server.timeline.RollingLevelDB.initFileSystem(RollingLevelDB.java:207)
	at org.apache.hadoop.yarn.server.timeline.RollingLevelDB.init(RollingLevelDB.java:200)
	at org.apache.hadoop.yarn.server.timeline.RollingLevelDBTimelineStore.serviceInit(RollingLevelDBTimelineStore.java:321)
	at org.apache.hadoop.service.AbstractService.init(AbstractService.java:163)
	at org.apache.hadoop.yarn.server.timeline.TestRollingLevelDBTimelineStore.setup(TestRollingLevelDBTimelineStore.java:65)


REGRESSION:  org.apache.hadoop.yarn.server.timeline.TestRollingLevelDBTimelineStore.testGetEvents

Error Message:
null

Stack Trace:
java.lang.UnsupportedOperationException: null
	at org.apache.hadoop.fs.permission.FsPermission$ImmutableFsPermission.applyUMask(FsPermission.java:380)
	at org.apache.hadoop.fs.RawLocalFileSystem.mkOneDirWithMode(RawLocalFileSystem.java:496)
	at org.apache.hadoop.fs.RawLocalFileSystem.mkdirsWithOptionalPermission(RawLocalFileSystem.java:551)
	at org.apache.hadoop.fs.RawLocalFileSystem.mkdirs(RawLocalFileSystem.java:529)
	at org.apache.hadoop.fs.FilterFileSystem.mkdirs(FilterFileSystem.java:314)
	at org.apache.hadoop.yarn.server.timeline.RollingLevelDB.initFileSystem(RollingLevelDB.java:207)
	at org.apache.hadoop.yarn.server.timeline.RollingLevelDB.init(RollingLevelDB.java:200)
	at org.apache.hadoop.yarn.server.timeline.RollingLevelDBTimelineStore.serviceInit(RollingLevelDBTimelineStore.java:321)
	at org.apache.hadoop.service.AbstractService.init(AbstractService.java:163)
	at org.apache.hadoop.yarn.server.timeline.TestRollingLevelDBTimelineStore.setup(TestRollingLevelDBTimelineStore.java:65)


REGRESSION:  org.apache.hadoop.yarn.server.timeline.TestRollingLevelDBTimelineStore.testGetEntitiesWithSecondaryFilters

Error Message:
null

Stack Trace:
java.lang.UnsupportedOperationException: null
	at org.apache.hadoop.fs.permission.FsPermission$ImmutableFsPermission.applyUMask(FsPermission.java:380)
	at org.apache.hadoop.fs.RawLocalFileSystem.mkOneDirWithMode(RawLocalFileSystem.java:496)
	at org.apache.hadoop.fs.RawLocalFileSystem.mkdirsWithOptionalPermission(RawLocalFileSystem.java:551)
	at org.apache.hadoop.fs.RawLocalFileSystem.mkdirs(RawLocalFileSystem.java:529)
	at org.apache.hadoop.fs.FilterFileSystem.mkdirs(FilterFileSystem.java:314)
	at org.apache.hadoop.yarn.server.timeline.RollingLevelDB.initFileSystem(RollingLevelDB.java:207)
	at org.apache.hadoop.yarn.server.timeline.RollingLevelDB.init(RollingLevelDB.java:200)
	at org.apache.hadoop.yarn.server.timeline.RollingLevelDBTimelineStore.serviceInit(RollingLevelDBTimelineStore.java:321)
	at org.apache.hadoop.service.AbstractService.init(AbstractService.java:163)
	at org.apache.hadoop.yarn.server.timeline.TestRollingLevelDBTimelineStore.setup(TestRollingLevelDBTimelineStore.java:65)


REGRESSION:  org.apache.hadoop.yarn.server.timeline.TestRollingLevelDBTimelineStore.testCheckVersion

Error Message:
null

Stack Trace:
java.lang.UnsupportedOperationException: null
	at org.apache.hadoop.fs.permission.FsPermission$ImmutableFsPermission.applyUMask(FsPermission.java:380)
	at org.apache.hadoop.fs.RawLocalFileSystem.mkOneDirWithMode(RawLocalFileSystem.java:496)
	at org.apache.hadoop.fs.RawLocalFileSystem.mkdirsWithOptionalPermission(RawLocalFileSystem.java:551)
	at org.apache.hadoop.fs.RawLocalFileSystem.mkdirs(RawLocalFileSystem.java:529)
	at org.apache.hadoop.fs.FilterFileSystem.mkdirs(FilterFileSystem.java:314)
	at org.apache.hadoop.yarn.server.timeline.RollingLevelDB.initFileSystem(RollingLevelDB.java:207)
	at org.apache.hadoop.yarn.server.timeline.RollingLevelDB.init(RollingLevelDB.java:200)
	at org.apache.hadoop.yarn.server.timeline.RollingLevelDBTimelineStore.serviceInit(RollingLevelDBTimelineStore.java:321)
	at org.apache.hadoop.service.AbstractService.init(AbstractService.java:163)
	at org.apache.hadoop.yarn.server.timeline.TestRollingLevelDBTimelineStore.setup(TestRollingLevelDBTimelineStore.java:65)


REGRESSION:  org.apache.hadoop.yarn.server.timeline.TestRollingLevelDBTimelineStore.testGetEntitiesWithFromId

Error Message:
null

Stack Trace:
java.lang.UnsupportedOperationException: null
	at org.apache.hadoop.fs.permission.FsPermission$ImmutableFsPermission.applyUMask(FsPermission.java:380)
	at org.apache.hadoop.fs.RawLocalFileSystem.mkOneDirWithMode(RawLocalFileSystem.java:496)
	at org.apache.hadoop.fs.RawLocalFileSystem.mkdirsWithOptionalPermission(RawLocalFileSystem.java:551)
	at org.apache.hadoop.fs.RawLocalFileSystem.mkdirs(RawLocalFileSystem.java:529)
	at org.apache.hadoop.fs.FilterFileSystem.mkdirs(FilterFileSystem.java:314)
	at org.apache.hadoop.yarn.server.timeline.RollingLevelDB.initFileSystem(RollingLevelDB.java:207)
	at org.apache.hadoop.yarn.server.timeline.RollingLevelDB.init(RollingLevelDB.java:200)
	at org.apache.hadoop.yarn.server.timeline.RollingLevelDBTimelineStore.serviceInit(RollingLevelDBTimelineStore.java:321)
	at org.apache.hadoop.service.AbstractService.init(AbstractService.java:163)
	at org.apache.hadoop.yarn.server.timeline.TestRollingLevelDBTimelineStore.setup(TestRollingLevelDBTimelineStore.java:65)


REGRESSION:  org.apache.hadoop.yarn.server.timeline.TestRollingLevelDBTimelineStore.testGetEntitiesWithFromTs

Error Message:
null

Stack Trace:
java.lang.UnsupportedOperationException: null
	at org.apache.hadoop.fs.permission.FsPermission$ImmutableFsPermission.applyUMask(FsPermission.java:380)
	at org.apache.hadoop.fs.RawLocalFileSystem.mkOneDirWithMode(RawLocalFileSystem.java:496)
	at org.apache.hadoop.fs.RawLocalFileSystem.mkdirsWithOptionalPermission(RawLocalFileSystem.java:551)
	at org.apache.hadoop.fs.RawLocalFileSystem.mkdirs(RawLocalFileSystem.java:529)
	at org.apache.hadoop.fs.FilterFileSystem.mkdirs(FilterFileSystem.java:314)
	at org.apache.hadoop.yarn.server.timeline.RollingLevelDB.initFileSystem(RollingLevelDB.java:207)
	at org.apache.hadoop.yarn.server.timeline.RollingLevelDB.init(RollingLevelDB.java:200)
	at org.apache.hadoop.yarn.server.timeline.RollingLevelDBTimelineStore.serviceInit(RollingLevelDBTimelineStore.java:321)
	at org.apache.hadoop.service.AbstractService.init(AbstractService.java:163)
	at org.apache.hadoop.yarn.server.timeline.TestRollingLevelDBTimelineStore.setup(TestRollingLevelDBTimelineStore.java:65)



Mime
  • Unnamed multipart/mixed (inline, None, 0 bytes)
View raw message