hadoop-yarn-dev mailing list archives

Site index · List index
Message view « Date » · « Thread »
Top « Date » · « Thread »
From Apache Jenkins Server <jenk...@builds.apache.org>
Subject Failed: YARN-2005 PreCommit Build #8350
Date Thu, 25 Jun 2015 23:26:29 GMT
Jira: https://issues.apache.org/jira/browse/YARN-2005
Build: https://builds.apache.org/job/PreCommit-YARN-Build/8350/

###################################################################################
########################## LAST 60 LINES OF THE CONSOLE ###########################
[...truncated 368 lines...]
|  +1  |              findbugs  |  3m 46s    | The patch does not introduce any 
|      |                        |            | new Findbugs (version 3.0.0)
|      |                        |            | warnings.
|  +1  |    tools/hadoop tests  |  0m 52s    | Tests passed in hadoop-sls. 
|  +1  |            yarn tests  |  0m 23s    | Tests passed in hadoop-yarn-api. 
|  -1  |            yarn tests  |  51m 5s    | Tests failed in 
|      |                        |            | hadoop-yarn-server-resourcemanager
|      |                        |            | .
|      |                        |  95m 51s   | 


             Reason | Tests
 Failed unit tests  |  hadoop.yarn.server.resourcemanager.rmapp.attempt.TestRMAppAttemptTransitions



|| Subsystem || Report/Notes ||
============================================================================
| Patch URL | http://issues.apache.org/jira/secure/attachment/12741955/YARN-2005.001.patch
|
| Optional Tests | javadoc javac unit findbugs checkstyle |
| git revision | trunk / aa5b15b |
| checkstyle |  /home/jenkins/jenkins-slave/workspace/PreCommit-YARN-Build/patchprocess/diffcheckstylehadoop-yarn-api.txt
|
| hadoop-sls test log | /home/jenkins/jenkins-slave/workspace/PreCommit-YARN-Build/patchprocess/testrun_hadoop-sls.txt
|
| hadoop-yarn-api test log | /home/jenkins/jenkins-slave/workspace/PreCommit-YARN-Build/patchprocess/testrun_hadoop-yarn-api.txt
|
| hadoop-yarn-server-resourcemanager test log | /home/jenkins/jenkins-slave/workspace/PreCommit-YARN-Build/patchprocess/testrun_hadoop-yarn-server-resourcemanager.txt
|
| Test Results | https://builds.apache.org/job/PreCommit-YARN-Build/8350/testReport/ |
| Java | 1.7.0_55 |
| uname | Linux asf905.gq1.ygridcore.net 3.13.0-36-lowlatency #63-Ubuntu SMP PREEMPT Wed Sep
3 21:56:12 UTC 2014 x86_64 x86_64 x86_64 GNU/Linux |


============================================================================
============================================================================
                          Adding comment to JIRA
============================================================================
============================================================================


Comment added.
d8f197c98b795e6de597ad714fb5331682fe5ce7 logged out


============================================================================
============================================================================
                              Finished build.
============================================================================
============================================================================


Build step 'Execute shell' marked build as failure
Archiving artifacts
Sending artifact delta relative to PreCommit-YARN-Build #8345
Archived 58 artifacts
Archive block size is 32768
Received 41 blocks and 28508144 bytes
Compression is 4.5%
Took 6 sec
Description set: MAPREDUCE-6413
Recording test results
Email was triggered for: Failure
Sending email for trigger: Failure



###################################################################################
############################## FAILED TESTS (if any) ##############################
6 tests failed.
FAILED:  org.apache.hadoop.yarn.server.resourcemanager.rmapp.attempt.TestRMAppAttemptTransitions.testEmptyTrackingUrlUnmanagedAM[0]

Error Message:

yarnScheduler.allocate(
    <any>,
    <any>,
    <any>,
    <any>,
    <any>
);
Never wanted here:
-> at org.apache.hadoop.yarn.server.resourcemanager.rmapp.attempt.TestRMAppAttemptTransitions.testAppAttemptScheduledState(TestRMAppAttemptTransitions.java:470)
But invoked here:
-> at org.apache.hadoop.yarn.server.resourcemanager.rmapp.attempt.RMAppAttemptImpl$AMLaunchedTransition.transition(RMAppAttemptImpl.java:1341)


Stack Trace:
org.mockito.exceptions.verification.NeverWantedButInvoked: 
yarnScheduler.allocate(
    <any>,
    <any>,
    <any>,
    <any>,
    <any>
);
Never wanted here:
-> at org.apache.hadoop.yarn.server.resourcemanager.rmapp.attempt.TestRMAppAttemptTransitions.testAppAttemptScheduledState(TestRMAppAttemptTransitions.java:470)
But invoked here:
-> at org.apache.hadoop.yarn.server.resourcemanager.rmapp.attempt.RMAppAttemptImpl$AMLaunchedTransition.transition(RMAppAttemptImpl.java:1341)

	at org.apache.hadoop.yarn.server.resourcemanager.rmapp.attempt.TestRMAppAttemptTransitions.testAppAttemptScheduledState(TestRMAppAttemptTransitions.java:470)
	at org.apache.hadoop.yarn.server.resourcemanager.rmapp.attempt.TestRMAppAttemptTransitions.scheduleApplicationAttempt(TestRMAppAttemptTransitions.java:628)
	at org.apache.hadoop.yarn.server.resourcemanager.rmapp.attempt.TestRMAppAttemptTransitions.testUnmanagedAMSuccess(TestRMAppAttemptTransitions.java:713)
	at org.apache.hadoop.yarn.server.resourcemanager.rmapp.attempt.TestRMAppAttemptTransitions.testEmptyTrackingUrlUnmanagedAM(TestRMAppAttemptTransitions.java:1116)


FAILED:  org.apache.hadoop.yarn.server.resourcemanager.rmapp.attempt.TestRMAppAttemptTransitions.testTrackingUrlUnmanagedAM[0]

Error Message:

yarnScheduler.allocate(
    <any>,
    <any>,
    <any>,
    <any>,
    <any>
);
Never wanted here:
-> at org.apache.hadoop.yarn.server.resourcemanager.rmapp.attempt.TestRMAppAttemptTransitions.testAppAttemptScheduledState(TestRMAppAttemptTransitions.java:470)
But invoked here:
-> at org.apache.hadoop.yarn.server.resourcemanager.rmapp.attempt.RMAppAttemptImpl$AMLaunchedTransition.transition(RMAppAttemptImpl.java:1341)


Stack Trace:
org.mockito.exceptions.verification.NeverWantedButInvoked: 
yarnScheduler.allocate(
    <any>,
    <any>,
    <any>,
    <any>,
    <any>
);
Never wanted here:
-> at org.apache.hadoop.yarn.server.resourcemanager.rmapp.attempt.TestRMAppAttemptTransitions.testAppAttemptScheduledState(TestRMAppAttemptTransitions.java:470)
But invoked here:
-> at org.apache.hadoop.yarn.server.resourcemanager.rmapp.attempt.RMAppAttemptImpl$AMLaunchedTransition.transition(RMAppAttemptImpl.java:1341)

	at org.apache.hadoop.yarn.server.resourcemanager.rmapp.attempt.TestRMAppAttemptTransitions.testAppAttemptScheduledState(TestRMAppAttemptTransitions.java:470)
	at org.apache.hadoop.yarn.server.resourcemanager.rmapp.attempt.TestRMAppAttemptTransitions.scheduleApplicationAttempt(TestRMAppAttemptTransitions.java:628)
	at org.apache.hadoop.yarn.server.resourcemanager.rmapp.attempt.TestRMAppAttemptTransitions.testUnmanagedAMSuccess(TestRMAppAttemptTransitions.java:713)
	at org.apache.hadoop.yarn.server.resourcemanager.rmapp.attempt.TestRMAppAttemptTransitions.testTrackingUrlUnmanagedAM(TestRMAppAttemptTransitions.java:1111)


FAILED:  org.apache.hadoop.yarn.server.resourcemanager.rmapp.attempt.TestRMAppAttemptTransitions.testNullTrackingUrlUnmanagedAM[0]

Error Message:

yarnScheduler.allocate(
    <any>,
    <any>,
    <any>,
    <any>,
    <any>
);
Never wanted here:
-> at org.apache.hadoop.yarn.server.resourcemanager.rmapp.attempt.TestRMAppAttemptTransitions.testAppAttemptScheduledState(TestRMAppAttemptTransitions.java:470)
But invoked here:
-> at org.apache.hadoop.yarn.server.resourcemanager.rmapp.attempt.RMAppAttemptImpl$AMLaunchedTransition.transition(RMAppAttemptImpl.java:1341)


Stack Trace:
org.mockito.exceptions.verification.NeverWantedButInvoked: 
yarnScheduler.allocate(
    <any>,
    <any>,
    <any>,
    <any>,
    <any>
);
Never wanted here:
-> at org.apache.hadoop.yarn.server.resourcemanager.rmapp.attempt.TestRMAppAttemptTransitions.testAppAttemptScheduledState(TestRMAppAttemptTransitions.java:470)
But invoked here:
-> at org.apache.hadoop.yarn.server.resourcemanager.rmapp.attempt.RMAppAttemptImpl$AMLaunchedTransition.transition(RMAppAttemptImpl.java:1341)

	at org.apache.hadoop.yarn.server.resourcemanager.rmapp.attempt.TestRMAppAttemptTransitions.testAppAttemptScheduledState(TestRMAppAttemptTransitions.java:470)
	at org.apache.hadoop.yarn.server.resourcemanager.rmapp.attempt.TestRMAppAttemptTransitions.scheduleApplicationAttempt(TestRMAppAttemptTransitions.java:628)
	at org.apache.hadoop.yarn.server.resourcemanager.rmapp.attempt.TestRMAppAttemptTransitions.testUnmanagedAMSuccess(TestRMAppAttemptTransitions.java:713)
	at org.apache.hadoop.yarn.server.resourcemanager.rmapp.attempt.TestRMAppAttemptTransitions.testNullTrackingUrlUnmanagedAM(TestRMAppAttemptTransitions.java:1121)


FAILED:  org.apache.hadoop.yarn.server.resourcemanager.rmapp.attempt.TestRMAppAttemptTransitions.testEmptyTrackingUrlUnmanagedAM[1]

Error Message:

yarnScheduler.allocate(
    <any>,
    <any>,
    <any>,
    <any>,
    <any>
);
Never wanted here:
-> at org.apache.hadoop.yarn.server.resourcemanager.rmapp.attempt.TestRMAppAttemptTransitions.testAppAttemptScheduledState(TestRMAppAttemptTransitions.java:470)
But invoked here:
-> at org.apache.hadoop.yarn.server.resourcemanager.rmapp.attempt.RMAppAttemptImpl$AMLaunchedTransition.transition(RMAppAttemptImpl.java:1341)


Stack Trace:
org.mockito.exceptions.verification.NeverWantedButInvoked: 
yarnScheduler.allocate(
    <any>,
    <any>,
    <any>,
    <any>,
    <any>
);
Never wanted here:
-> at org.apache.hadoop.yarn.server.resourcemanager.rmapp.attempt.TestRMAppAttemptTransitions.testAppAttemptScheduledState(TestRMAppAttemptTransitions.java:470)
But invoked here:
-> at org.apache.hadoop.yarn.server.resourcemanager.rmapp.attempt.RMAppAttemptImpl$AMLaunchedTransition.transition(RMAppAttemptImpl.java:1341)

	at org.apache.hadoop.yarn.server.resourcemanager.rmapp.attempt.TestRMAppAttemptTransitions.testAppAttemptScheduledState(TestRMAppAttemptTransitions.java:470)
	at org.apache.hadoop.yarn.server.resourcemanager.rmapp.attempt.TestRMAppAttemptTransitions.scheduleApplicationAttempt(TestRMAppAttemptTransitions.java:628)
	at org.apache.hadoop.yarn.server.resourcemanager.rmapp.attempt.TestRMAppAttemptTransitions.testUnmanagedAMSuccess(TestRMAppAttemptTransitions.java:713)
	at org.apache.hadoop.yarn.server.resourcemanager.rmapp.attempt.TestRMAppAttemptTransitions.testEmptyTrackingUrlUnmanagedAM(TestRMAppAttemptTransitions.java:1116)


FAILED:  org.apache.hadoop.yarn.server.resourcemanager.rmapp.attempt.TestRMAppAttemptTransitions.testTrackingUrlUnmanagedAM[1]

Error Message:

yarnScheduler.allocate(
    <any>,
    <any>,
    <any>,
    <any>,
    <any>
);
Never wanted here:
-> at org.apache.hadoop.yarn.server.resourcemanager.rmapp.attempt.TestRMAppAttemptTransitions.testAppAttemptScheduledState(TestRMAppAttemptTransitions.java:470)
But invoked here:
-> at org.apache.hadoop.yarn.server.resourcemanager.rmapp.attempt.RMAppAttemptImpl$AMLaunchedTransition.transition(RMAppAttemptImpl.java:1341)


Stack Trace:
org.mockito.exceptions.verification.NeverWantedButInvoked: 
yarnScheduler.allocate(
    <any>,
    <any>,
    <any>,
    <any>,
    <any>
);
Never wanted here:
-> at org.apache.hadoop.yarn.server.resourcemanager.rmapp.attempt.TestRMAppAttemptTransitions.testAppAttemptScheduledState(TestRMAppAttemptTransitions.java:470)
But invoked here:
-> at org.apache.hadoop.yarn.server.resourcemanager.rmapp.attempt.RMAppAttemptImpl$AMLaunchedTransition.transition(RMAppAttemptImpl.java:1341)

	at org.apache.hadoop.yarn.server.resourcemanager.rmapp.attempt.TestRMAppAttemptTransitions.testAppAttemptScheduledState(TestRMAppAttemptTransitions.java:470)
	at org.apache.hadoop.yarn.server.resourcemanager.rmapp.attempt.TestRMAppAttemptTransitions.scheduleApplicationAttempt(TestRMAppAttemptTransitions.java:628)
	at org.apache.hadoop.yarn.server.resourcemanager.rmapp.attempt.TestRMAppAttemptTransitions.testUnmanagedAMSuccess(TestRMAppAttemptTransitions.java:713)
	at org.apache.hadoop.yarn.server.resourcemanager.rmapp.attempt.TestRMAppAttemptTransitions.testTrackingUrlUnmanagedAM(TestRMAppAttemptTransitions.java:1111)


FAILED:  org.apache.hadoop.yarn.server.resourcemanager.rmapp.attempt.TestRMAppAttemptTransitions.testNullTrackingUrlUnmanagedAM[1]

Error Message:

yarnScheduler.allocate(
    <any>,
    <any>,
    <any>,
    <any>,
    <any>
);
Never wanted here:
-> at org.apache.hadoop.yarn.server.resourcemanager.rmapp.attempt.TestRMAppAttemptTransitions.testAppAttemptScheduledState(TestRMAppAttemptTransitions.java:470)
But invoked here:
-> at org.apache.hadoop.yarn.server.resourcemanager.rmapp.attempt.RMAppAttemptImpl$AMLaunchedTransition.transition(RMAppAttemptImpl.java:1341)


Stack Trace:
org.mockito.exceptions.verification.NeverWantedButInvoked: 
yarnScheduler.allocate(
    <any>,
    <any>,
    <any>,
    <any>,
    <any>
);
Never wanted here:
-> at org.apache.hadoop.yarn.server.resourcemanager.rmapp.attempt.TestRMAppAttemptTransitions.testAppAttemptScheduledState(TestRMAppAttemptTransitions.java:470)
But invoked here:
-> at org.apache.hadoop.yarn.server.resourcemanager.rmapp.attempt.RMAppAttemptImpl$AMLaunchedTransition.transition(RMAppAttemptImpl.java:1341)

	at org.apache.hadoop.yarn.server.resourcemanager.rmapp.attempt.TestRMAppAttemptTransitions.testAppAttemptScheduledState(TestRMAppAttemptTransitions.java:470)
	at org.apache.hadoop.yarn.server.resourcemanager.rmapp.attempt.TestRMAppAttemptTransitions.scheduleApplicationAttempt(TestRMAppAttemptTransitions.java:628)
	at org.apache.hadoop.yarn.server.resourcemanager.rmapp.attempt.TestRMAppAttemptTransitions.testUnmanagedAMSuccess(TestRMAppAttemptTransitions.java:713)
	at org.apache.hadoop.yarn.server.resourcemanager.rmapp.attempt.TestRMAppAttemptTransitions.testNullTrackingUrlUnmanagedAM(TestRMAppAttemptTransitions.java:1121)



Mime
  • Unnamed multipart/mixed (inline, None, 0 bytes)
View raw message