hadoop-yarn-dev mailing list archives

Site index · List index
Message view « Date » · « Thread »
Top « Date » · « Thread »
From Apache Jenkins Server <jenk...@builds.apache.org>
Subject Failed: YARN-41 PreCommit Build #8175
Date Wed, 03 Jun 2015 16:19:48 GMT
Jira: https://issues.apache.org/jira/browse/YARN-41
Build: https://builds.apache.org/job/PreCommit-YARN-Build/8175/

###################################################################################
########################## LAST 60 LINES OF THE CONSOLE ###########################
[...truncated 376 lines...]
|  -1  |         yarn tests  |  48m 0s    | Tests failed in 
|      |                     |            | hadoop-yarn-server-resourcemanager.
|  +1  |         yarn tests  |  1m 56s    | Tests passed in 
|      |                     |            | hadoop-yarn-server-tests.
|      |                     |  115m 37s  | 


             Reason | Tests
 Failed unit tests  |  hadoop.yarn.server.nodemanager.containermanager.logaggregation.TestLogAggregationService

                    |  hadoop.yarn.server.resourcemanager.TestRMRestart 
   Timed out tests  |  org.apache.hadoop.yarn.server.resourcemanager.scheduler.capacity.TestNodeLabelContainerAllocation



|| Subsystem || Report/Notes ||
============================================================================
| Patch URL | http://issues.apache.org/jira/secure/attachment/12735565/YARN-41-8.patch |
| Optional Tests | javadoc javac unit findbugs checkstyle |
| git revision | trunk / c59e745 |
| Pre-patch Findbugs warnings | /home/jenkins/jenkins-slave/workspace/PreCommit-YARN-Build/patchprocess/trunkFindbugsWarningshadoop-yarn-server-common.html
|
| hadoop-yarn-api test log | /home/jenkins/jenkins-slave/workspace/PreCommit-YARN-Build/patchprocess/testrun_hadoop-yarn-api.txt
|
| hadoop-yarn-server-common test log | /home/jenkins/jenkins-slave/workspace/PreCommit-YARN-Build/patchprocess/testrun_hadoop-yarn-server-common.txt
|
| hadoop-yarn-server-nodemanager test log | /home/jenkins/jenkins-slave/workspace/PreCommit-YARN-Build/patchprocess/testrun_hadoop-yarn-server-nodemanager.txt
|
| hadoop-yarn-server-resourcemanager test log | /home/jenkins/jenkins-slave/workspace/PreCommit-YARN-Build/patchprocess/testrun_hadoop-yarn-server-resourcemanager.txt
|
| hadoop-yarn-server-tests test log | /home/jenkins/jenkins-slave/workspace/PreCommit-YARN-Build/patchprocess/testrun_hadoop-yarn-server-tests.txt
|
| Test Results | https://builds.apache.org/job/PreCommit-YARN-Build/8175/testReport/ |
| Java | 1.7.0_55 |
| uname | Linux asf908.gq1.ygridcore.net 3.13.0-36-lowlatency #63-Ubuntu SMP PREEMPT Wed Sep
3 21:56:12 UTC 2014 x86_64 x86_64 x86_64 GNU/Linux |


============================================================================
============================================================================
                          Adding comment to JIRA
============================================================================
============================================================================


Comment added.
ff9fe24d34f5949f0346dc70e5a7613962926dc8 logged out


============================================================================
============================================================================
                              Finished build.
============================================================================
============================================================================


Build step 'Execute shell' marked build as failure
Archiving artifacts
Sending artifact delta relative to PreCommit-YARN-Build #8174
Archived 85 artifacts
Archive block size is 32768
Received 90 blocks and 32500172 bytes
Compression is 8.3%
Took 8.7 sec
[description-setter] Could not determine description.
Recording test results
Email was triggered for: Failure
Sending email for trigger: Failure



###################################################################################
############################## FAILED TESTS (if any) ##############################
2 tests failed.
FAILED:  org.apache.hadoop.yarn.server.nodemanager.containermanager.logaggregation.TestLogAggregationService.testLogAggregationServiceWithRetention

Error Message:
expected:<-1> but was:<1>

Stack Trace:
java.lang.AssertionError: expected:<-1> but was:<1>
	at org.junit.Assert.fail(Assert.java:88)
	at org.junit.Assert.failNotEquals(Assert.java:743)
	at org.junit.Assert.assertEquals(Assert.java:118)
	at org.junit.Assert.assertEquals(Assert.java:555)
	at org.junit.Assert.assertEquals(Assert.java:542)
	at org.apache.hadoop.yarn.server.nodemanager.containermanager.logaggregation.TestLogAggregationService.testLogAggregationService(TestLogAggregationService.java:1399)
	at org.apache.hadoop.yarn.server.nodemanager.containermanager.logaggregation.TestLogAggregationService.testLogAggregationServiceWithRetention(TestLogAggregationService.java:1294)


REGRESSION:  org.apache.hadoop.yarn.server.resourcemanager.TestRMRestart.testRMRestartGetApplicationList[1]

Error Message:

Wanted but not invoked:
rMAppManager.logApplicationSummary(
    isA(org.apache.hadoop.yarn.api.records.ApplicationId)
);
-> at org.apache.hadoop.yarn.server.resourcemanager.TestRMRestart.testRMRestartGetApplicationList(TestRMRestart.java:980)

However, there were other interactions with this mock:
-> at org.apache.hadoop.yarn.server.resourcemanager.ResourceManager.recover(ResourceManager.java:1191)
-> at org.apache.hadoop.yarn.server.resourcemanager.ResourceManager.recover(ResourceManager.java:1191)
-> at org.apache.hadoop.yarn.server.resourcemanager.ResourceManager.recover(ResourceManager.java:1191)
-> at org.apache.hadoop.yarn.server.resourcemanager.ResourceManager.recover(ResourceManager.java:1191)


Stack Trace:
org.mockito.exceptions.verification.WantedButNotInvoked: 
Wanted but not invoked:
rMAppManager.logApplicationSummary(
    isA(org.apache.hadoop.yarn.api.records.ApplicationId)
);
-> at org.apache.hadoop.yarn.server.resourcemanager.TestRMRestart.testRMRestartGetApplicationList(TestRMRestart.java:980)

However, there were other interactions with this mock:
-> at org.apache.hadoop.yarn.server.resourcemanager.ResourceManager.recover(ResourceManager.java:1191)
-> at org.apache.hadoop.yarn.server.resourcemanager.ResourceManager.recover(ResourceManager.java:1191)
-> at org.apache.hadoop.yarn.server.resourcemanager.ResourceManager.recover(ResourceManager.java:1191)
-> at org.apache.hadoop.yarn.server.resourcemanager.ResourceManager.recover(ResourceManager.java:1191)

	at org.apache.hadoop.yarn.server.resourcemanager.TestRMRestart.testRMRestartGetApplicationList(TestRMRestart.java:980)



Mime
  • Unnamed multipart/mixed (inline, None, 0 bytes)
View raw message