hadoop-yarn-dev mailing list archives

Site index · List index
Message view « Date » · « Thread »
Top « Date » · « Thread »
From Apache Jenkins Server <jenk...@builds.apache.org>
Subject Failed: YARN-2716 PreCommit Build #8200
Date Fri, 05 Jun 2015 20:13:33 GMT
Jira: https://issues.apache.org/jira/browse/YARN-2716
Build: https://builds.apache.org/job/PreCommit-YARN-Build/8200/

###################################################################################
########################## LAST 60 LINES OF THE CONSOLE ###########################
[...truncated 317 lines...]
|      |                     |            | whitespace.
|  +1  |            install  |  1m 35s    | mvn install still works. 
|  +1  |    eclipse:eclipse  |  0m 33s    | The patch built with 
|      |                     |            | eclipse:eclipse.
|  +1  |           findbugs  |  2m 57s    | The patch does not introduce any 
|      |                     |            | new Findbugs (version 3.0.0)
|      |                     |            | warnings.
|  +1  |         yarn tests  |  0m 31s    | Tests passed in hadoop-yarn-api. 
|  -1  |         yarn tests  |  50m 47s   | Tests failed in 
|      |                     |            | hadoop-yarn-server-resourcemanager.
|      |                     |  92m 58s   | 


             Reason | Tests
 Failed unit tests  |  hadoop.yarn.server.resourcemanager.TestWorkPreservingRMRestart 


|| Subsystem || Report/Notes ||
============================================================================
| Patch URL | http://issues.apache.org/jira/secure/attachment/12738007/yarn-2716-2.patch |
| Optional Tests | javadoc javac unit findbugs checkstyle |
| git revision | trunk / 7588585 |
| hadoop-yarn-api test log | /home/jenkins/jenkins-slave/workspace/PreCommit-YARN-Build/patchprocess/testrun_hadoop-yarn-api.txt
|
| hadoop-yarn-server-resourcemanager test log | /home/jenkins/jenkins-slave/workspace/PreCommit-YARN-Build/patchprocess/testrun_hadoop-yarn-server-resourcemanager.txt
|
| Test Results | https://builds.apache.org/job/PreCommit-YARN-Build/8200/testReport/ |
| Java | 1.7.0_55 |
| uname | Linux asf905.gq1.ygridcore.net 3.13.0-36-lowlatency #63-Ubuntu SMP PREEMPT Wed Sep
3 21:56:12 UTC 2014 x86_64 x86_64 x86_64 GNU/Linux |


============================================================================
============================================================================
                          Adding comment to JIRA
============================================================================
============================================================================


Comment added.
fcf7202e2a98d69e8399546ba159c269bbd14c2a logged out


============================================================================
============================================================================
                              Finished build.
============================================================================
============================================================================


Build step 'Execute shell' marked build as failure
Archiving artifacts
Sending artifact delta relative to PreCommit-YARN-Build #8198
Archived 43 artifacts
Archive block size is 32768
Received 92 blocks and 26907843 bytes
Compression is 10.1%
Took 6.4 sec
[description-setter] Could not determine description.
Recording test results
Email was triggered for: Failure
Sending email for trigger: Failure



###################################################################################
############################## FAILED TESTS (if any) ##############################
1 tests failed.
FAILED:  org.apache.hadoop.yarn.server.resourcemanager.TestWorkPreservingRMRestart.testSchedulerRecovery[1]

Error Message:
expected:<6144> but was:<8192>

Stack Trace:
java.lang.AssertionError: expected:<6144> but was:<8192>
	at org.junit.Assert.fail(Assert.java:88)
	at org.junit.Assert.failNotEquals(Assert.java:743)
	at org.junit.Assert.assertEquals(Assert.java:118)
	at org.junit.Assert.assertEquals(Assert.java:555)
	at org.junit.Assert.assertEquals(Assert.java:542)
	at org.apache.hadoop.yarn.server.resourcemanager.TestWorkPreservingRMRestart.assertMetrics(TestWorkPreservingRMRestart.java:852)
	at org.apache.hadoop.yarn.server.resourcemanager.TestWorkPreservingRMRestart.checkFSQueue(TestWorkPreservingRMRestart.java:341)
	at org.apache.hadoop.yarn.server.resourcemanager.TestWorkPreservingRMRestart.testSchedulerRecovery(TestWorkPreservingRMRestart.java:240)



Mime
  • Unnamed multipart/mixed (inline, None, 0 bytes)
View raw message