hadoop-yarn-dev mailing list archives

Site index · List index
Message view « Date » · « Thread »
Top « Date » · « Thread »
From Apache Jenkins Server <jenk...@builds.apache.org>
Subject Hadoop-Yarn-trunk-Java8 - Build # 217 - Still Failing
Date Wed, 03 Jun 2015 10:48:07 GMT
See https://builds.apache.org/job/Hadoop-Yarn-trunk-Java8/217/

###################################################################################
########################## LAST 60 LINES OF THE CONSOLE ###########################
[...truncated 4652 lines...]
Tests run: 202, Failures: 4, Errors: 0, Skipped: 0

[INFO] ------------------------------------------------------------------------
[INFO] Reactor Summary:
[INFO] 
[INFO] Apache Hadoop YARN ................................ SUCCESS [  3.129 s]
[INFO] Apache Hadoop YARN API ............................ SUCCESS [01:15 min]
[INFO] Apache Hadoop YARN Common ......................... SUCCESS [02:23 min]
[INFO] Apache Hadoop YARN Server ......................... SUCCESS [  0.094 s]
[INFO] Apache Hadoop YARN Server Common .................. SUCCESS [ 37.914 s]
[INFO] Apache Hadoop YARN NodeManager .................... SUCCESS [07:52 min]
[INFO] Apache Hadoop YARN Web Proxy ...................... SUCCESS [ 15.261 s]
[INFO] Apache Hadoop YARN ApplicationHistoryService ...... FAILURE [02:54 min]
[INFO] Apache Hadoop YARN ResourceManager ................ SKIPPED
[INFO] Apache Hadoop YARN Server Tests ................... SKIPPED
[INFO] Apache Hadoop YARN Client ......................... SKIPPED
[INFO] Apache Hadoop YARN SharedCacheManager ............. SKIPPED
[INFO] Apache Hadoop YARN Applications ................... SKIPPED
[INFO] Apache Hadoop YARN DistributedShell ............... SKIPPED
[INFO] Apache Hadoop YARN Unmanaged Am Launcher .......... SKIPPED
[INFO] Apache Hadoop YARN Site ........................... SKIPPED
[INFO] Apache Hadoop YARN Registry ....................... SKIPPED
[INFO] Apache Hadoop YARN Project ........................ SKIPPED
[INFO] ------------------------------------------------------------------------
[INFO] BUILD FAILURE
[INFO] ------------------------------------------------------------------------
[INFO] Total time: 15:23 min
[INFO] Finished at: 2015-06-03T10:47:59+00:00
[INFO] Final Memory: 87M/1060M
[INFO] ------------------------------------------------------------------------
[ERROR] Failed to execute goal org.apache.maven.plugins:maven-surefire-plugin:2.17:test (default-test)
on project hadoop-yarn-server-applicationhistoryservice: There are test failures.
[ERROR] 
[ERROR] Please refer to /home/jenkins/jenkins-slave/workspace/Hadoop-Yarn-trunk-Java8/hadoop-yarn-project/hadoop-yarn/hadoop-yarn-server/hadoop-yarn-server-applicationhistoryservice/target/surefire-reports
for the individual test results.
[ERROR] -> [Help 1]
[ERROR] 
[ERROR] To see the full stack trace of the errors, re-run Maven with the -e switch.
[ERROR] Re-run Maven using the -X switch to enable full debug logging.
[ERROR] 
[ERROR] For more information about the errors and possible solutions, please read the following
articles:
[ERROR] [Help 1] http://cwiki.apache.org/confluence/display/MAVEN/MojoFailureException
[ERROR] 
[ERROR] After correcting the problems, you can resume the build with the command
[ERROR]   mvn <goals> -rf :hadoop-yarn-server-applicationhistoryservice
Build step 'Execute shell' marked build as failure
Archiving artifacts
Recording test results
Updating HDFS-8470
Updating HADOOP-11991
Updating HDFS-8386
Updating HDFS-8513
Updating HDFS-8486
Updating HDFS-8270
Updating HDFS-8256
Updating HDFS-3716
Updating HDFS-8523
Updating HDFS-8521
Sending e-mails to: yarn-dev@hadoop.apache.org
Email was triggered for: Failure
Sending email for trigger: Failure



###################################################################################
############################## FAILED TESTS (if any) ##############################
4 tests failed.
FAILED:  org.apache.hadoop.yarn.server.applicationhistoryservice.webapp.TestAHSWebServices.testAppsQuery[0]

Error Message:
incorrect number of elements expected:<1> but was:<2>

Stack Trace:
java.lang.AssertionError: incorrect number of elements expected:<1> but was:<2>
	at org.junit.Assert.fail(Assert.java:88)
	at org.junit.Assert.failNotEquals(Assert.java:743)
	at org.junit.Assert.assertEquals(Assert.java:118)
	at org.junit.Assert.assertEquals(Assert.java:555)
	at org.apache.hadoop.yarn.server.applicationhistoryservice.webapp.TestAHSWebServices.testAppsQuery(TestAHSWebServices.java:320)


FAILED:  org.apache.hadoop.yarn.server.applicationhistoryservice.webapp.TestAHSWebServices.testSingleApp[0]

Error Message:
incorrect number of elements expected:<1> but was:<2>

Stack Trace:
java.lang.AssertionError: incorrect number of elements expected:<1> but was:<2>
	at org.junit.Assert.fail(Assert.java:88)
	at org.junit.Assert.failNotEquals(Assert.java:743)
	at org.junit.Assert.assertEquals(Assert.java:118)
	at org.junit.Assert.assertEquals(Assert.java:555)
	at org.apache.hadoop.yarn.server.applicationhistoryservice.webapp.TestAHSWebServices.testSingleApp(TestAHSWebServices.java:339)


FAILED:  org.apache.hadoop.yarn.server.applicationhistoryservice.webapp.TestAHSWebServices.testAppsQuery[1]

Error Message:
incorrect number of elements expected:<1> but was:<2>

Stack Trace:
java.lang.AssertionError: incorrect number of elements expected:<1> but was:<2>
	at org.junit.Assert.fail(Assert.java:88)
	at org.junit.Assert.failNotEquals(Assert.java:743)
	at org.junit.Assert.assertEquals(Assert.java:118)
	at org.junit.Assert.assertEquals(Assert.java:555)
	at org.apache.hadoop.yarn.server.applicationhistoryservice.webapp.TestAHSWebServices.testAppsQuery(TestAHSWebServices.java:320)


FAILED:  org.apache.hadoop.yarn.server.applicationhistoryservice.webapp.TestAHSWebServices.testSingleApp[1]

Error Message:
incorrect number of elements expected:<1> but was:<2>

Stack Trace:
java.lang.AssertionError: incorrect number of elements expected:<1> but was:<2>
	at org.junit.Assert.fail(Assert.java:88)
	at org.junit.Assert.failNotEquals(Assert.java:743)
	at org.junit.Assert.assertEquals(Assert.java:118)
	at org.junit.Assert.assertEquals(Assert.java:555)
	at org.apache.hadoop.yarn.server.applicationhistoryservice.webapp.TestAHSWebServices.testSingleApp(TestAHSWebServices.java:339)



Mime
  • Unnamed multipart/mixed (inline, None, 0 bytes)
View raw message