hadoop-yarn-dev mailing list archives

Site index · List index
Message view « Date » · « Thread »
Top « Date » · « Thread »
From Apache Jenkins Server <jenk...@builds.apache.org>
Subject Build failed in Jenkins: Hadoop-Yarn-trunk #945
Date Mon, 01 Jun 2015 10:49:05 GMT
See <https://builds.apache.org/job/Hadoop-Yarn-trunk/945/changes>

Changes:

[ozawa] HDFS-8490. Typo in trace enabled log in ExceptionHandler of WebHDFS. Contributed by
Archana T.

[xgong] YARN-2900. Application (Attempt and Container) Not Found in AHS results

[wangda] YARN-3725. App submission via REST API is broken in secure mode due to Timeline DT
service address is empty. (Zhijie Shen via wangda)

------------------------------------------
[...truncated 8170 lines...]
[INFO] Building jar: <https://builds.apache.org/job/Hadoop-Yarn-trunk/ws/hadoop-yarn-project/hadoop-yarn/hadoop-yarn-server/hadoop-yarn-server-web-proxy/target/hadoop-yarn-server-web-proxy-3.0.0-SNAPSHOT-sources.jar>
[INFO] 
[INFO] --- maven-source-plugin:2.3:test-jar-no-fork (hadoop-java-sources) @ hadoop-yarn-server-web-proxy
---
[INFO] Building jar: <https://builds.apache.org/job/Hadoop-Yarn-trunk/ws/hadoop-yarn-project/hadoop-yarn/hadoop-yarn-server/hadoop-yarn-server-web-proxy/target/hadoop-yarn-server-web-proxy-3.0.0-SNAPSHOT-test-sources.jar>
[INFO] 
[INFO] --- maven-enforcer-plugin:1.3.1:enforce (dist-enforce) @ hadoop-yarn-server-web-proxy
---
[INFO] 
[INFO] --- maven-site-plugin:3.4:attach-descriptor (attach-descriptor) @ hadoop-yarn-server-web-proxy
---
[INFO] 
[INFO] --- maven-javadoc-plugin:2.8.1:jar (module-javadocs) @ hadoop-yarn-server-web-proxy
---
[INFO] 
Loading source files for package org.apache.hadoop.yarn.server.webproxy...
Loading source files for package org.apache.hadoop.yarn.server.webproxy.amfilter...
Constructing Javadoc information...
Standard Doclet version 1.7.0_55
Building tree for all the packages and classes...
Generating <https://builds.apache.org/job/Hadoop-Yarn-trunk/ws/hadoop-yarn-project/hadoop-yarn/hadoop-yarn-server/hadoop-yarn-server-web-proxy/target/org/apache/hadoop/yarn/server/webproxy/AppReportFetcher.html...>
Generating <https://builds.apache.org/job/Hadoop-Yarn-trunk/ws/hadoop-yarn-project/hadoop-yarn/hadoop-yarn-server/hadoop-yarn-server-web-proxy/target/org/apache/hadoop/yarn/server/webproxy/ProxyUriUtils.html...>
Generating <https://builds.apache.org/job/Hadoop-Yarn-trunk/ws/hadoop-yarn-project/hadoop-yarn/hadoop-yarn-server/hadoop-yarn-server-web-proxy/target/org/apache/hadoop/yarn/server/webproxy/ProxyUtils.html...>
Generating <https://builds.apache.org/job/Hadoop-Yarn-trunk/ws/hadoop-yarn-project/hadoop-yarn/hadoop-yarn-server/hadoop-yarn-server-web-proxy/target/org/apache/hadoop/yarn/server/webproxy/ProxyUtils._.html...>
Generating <https://builds.apache.org/job/Hadoop-Yarn-trunk/ws/hadoop-yarn-project/hadoop-yarn/hadoop-yarn-server/hadoop-yarn-server-web-proxy/target/org/apache/hadoop/yarn/server/webproxy/ProxyUtils.Page.html...>
Generating <https://builds.apache.org/job/Hadoop-Yarn-trunk/ws/hadoop-yarn-project/hadoop-yarn/hadoop-yarn-server/hadoop-yarn-server-web-proxy/target/org/apache/hadoop/yarn/server/webproxy/WebAppProxy.html...>
Generating <https://builds.apache.org/job/Hadoop-Yarn-trunk/ws/hadoop-yarn-project/hadoop-yarn/hadoop-yarn-server/hadoop-yarn-server-web-proxy/target/org/apache/hadoop/yarn/server/webproxy/WebAppProxyServer.html...>
Generating <https://builds.apache.org/job/Hadoop-Yarn-trunk/ws/hadoop-yarn-project/hadoop-yarn/hadoop-yarn-server/hadoop-yarn-server-web-proxy/target/org/apache/hadoop/yarn/server/webproxy/WebAppProxyServlet.html...>
Generating <https://builds.apache.org/job/Hadoop-Yarn-trunk/ws/hadoop-yarn-project/hadoop-yarn/hadoop-yarn-server/hadoop-yarn-server-web-proxy/target/org/apache/hadoop/yarn/server/webproxy/amfilter/AmFilterInitializer.html...>
Generating <https://builds.apache.org/job/Hadoop-Yarn-trunk/ws/hadoop-yarn-project/hadoop-yarn/hadoop-yarn-server/hadoop-yarn-server-web-proxy/target/org/apache/hadoop/yarn/server/webproxy/amfilter/AmIpFilter.html...>
Generating <https://builds.apache.org/job/Hadoop-Yarn-trunk/ws/hadoop-yarn-project/hadoop-yarn/hadoop-yarn-server/hadoop-yarn-server-web-proxy/target/org/apache/hadoop/yarn/server/webproxy/amfilter/AmIpPrincipal.html...>
Generating <https://builds.apache.org/job/Hadoop-Yarn-trunk/ws/hadoop-yarn-project/hadoop-yarn/hadoop-yarn-server/hadoop-yarn-server-web-proxy/target/org/apache/hadoop/yarn/server/webproxy/amfilter/AmIpServletRequestWrapper.html...>
Generating <https://builds.apache.org/job/Hadoop-Yarn-trunk/ws/hadoop-yarn-project/hadoop-yarn/hadoop-yarn-server/hadoop-yarn-server-web-proxy/target/overview-frame.html...>
Generating <https://builds.apache.org/job/Hadoop-Yarn-trunk/ws/hadoop-yarn-project/hadoop-yarn/hadoop-yarn-server/hadoop-yarn-server-web-proxy/target/org/apache/hadoop/yarn/server/webproxy/package-frame.html...>
Generating <https://builds.apache.org/job/Hadoop-Yarn-trunk/ws/hadoop-yarn-project/hadoop-yarn/hadoop-yarn-server/hadoop-yarn-server-web-proxy/target/org/apache/hadoop/yarn/server/webproxy/package-summary.html...>
Generating <https://builds.apache.org/job/Hadoop-Yarn-trunk/ws/hadoop-yarn-project/hadoop-yarn/hadoop-yarn-server/hadoop-yarn-server-web-proxy/target/org/apache/hadoop/yarn/server/webproxy/package-tree.html...>
Generating <https://builds.apache.org/job/Hadoop-Yarn-trunk/ws/hadoop-yarn-project/hadoop-yarn/hadoop-yarn-server/hadoop-yarn-server-web-proxy/target/org/apache/hadoop/yarn/server/webproxy/amfilter/package-frame.html...>
Generating <https://builds.apache.org/job/Hadoop-Yarn-trunk/ws/hadoop-yarn-project/hadoop-yarn/hadoop-yarn-server/hadoop-yarn-server-web-proxy/target/org/apache/hadoop/yarn/server/webproxy/amfilter/package-summary.html...>
Generating <https://builds.apache.org/job/Hadoop-Yarn-trunk/ws/hadoop-yarn-project/hadoop-yarn/hadoop-yarn-server/hadoop-yarn-server-web-proxy/target/org/apache/hadoop/yarn/server/webproxy/amfilter/package-tree.html...>
Generating <https://builds.apache.org/job/Hadoop-Yarn-trunk/ws/hadoop-yarn-project/hadoop-yarn/hadoop-yarn-server/hadoop-yarn-server-web-proxy/target/constant-values.html...>
Generating <https://builds.apache.org/job/Hadoop-Yarn-trunk/ws/hadoop-yarn-project/hadoop-yarn/hadoop-yarn-server/hadoop-yarn-server-web-proxy/target/serialized-form.html...>
Generating <https://builds.apache.org/job/Hadoop-Yarn-trunk/ws/hadoop-yarn-project/hadoop-yarn/hadoop-yarn-server/hadoop-yarn-server-web-proxy/target/org/apache/hadoop/yarn/server/webproxy/class-use/WebAppProxyServer.html...>
Generating <https://builds.apache.org/job/Hadoop-Yarn-trunk/ws/hadoop-yarn-project/hadoop-yarn/hadoop-yarn-server/hadoop-yarn-server-web-proxy/target/org/apache/hadoop/yarn/server/webproxy/class-use/AppReportFetcher.html...>
Generating <https://builds.apache.org/job/Hadoop-Yarn-trunk/ws/hadoop-yarn-project/hadoop-yarn/hadoop-yarn-server/hadoop-yarn-server-web-proxy/target/org/apache/hadoop/yarn/server/webproxy/class-use/ProxyUtils.html...>
Generating <https://builds.apache.org/job/Hadoop-Yarn-trunk/ws/hadoop-yarn-project/hadoop-yarn/hadoop-yarn-server/hadoop-yarn-server-web-proxy/target/org/apache/hadoop/yarn/server/webproxy/class-use/ProxyUtils._.html...>
Generating <https://builds.apache.org/job/Hadoop-Yarn-trunk/ws/hadoop-yarn-project/hadoop-yarn/hadoop-yarn-server/hadoop-yarn-server-web-proxy/target/org/apache/hadoop/yarn/server/webproxy/class-use/ProxyUtils.Page.html...>
Generating <https://builds.apache.org/job/Hadoop-Yarn-trunk/ws/hadoop-yarn-project/hadoop-yarn/hadoop-yarn-server/hadoop-yarn-server-web-proxy/target/org/apache/hadoop/yarn/server/webproxy/class-use/WebAppProxyServlet.html...>
Generating <https://builds.apache.org/job/Hadoop-Yarn-trunk/ws/hadoop-yarn-project/hadoop-yarn/hadoop-yarn-server/hadoop-yarn-server-web-proxy/target/org/apache/hadoop/yarn/server/webproxy/class-use/ProxyUriUtils.html...>
Generating <https://builds.apache.org/job/Hadoop-Yarn-trunk/ws/hadoop-yarn-project/hadoop-yarn/hadoop-yarn-server/hadoop-yarn-server-web-proxy/target/org/apache/hadoop/yarn/server/webproxy/class-use/WebAppProxy.html...>
Generating <https://builds.apache.org/job/Hadoop-Yarn-trunk/ws/hadoop-yarn-project/hadoop-yarn/hadoop-yarn-server/hadoop-yarn-server-web-proxy/target/org/apache/hadoop/yarn/server/webproxy/amfilter/class-use/AmIpFilter.html...>
Generating <https://builds.apache.org/job/Hadoop-Yarn-trunk/ws/hadoop-yarn-project/hadoop-yarn/hadoop-yarn-server/hadoop-yarn-server-web-proxy/target/org/apache/hadoop/yarn/server/webproxy/amfilter/class-use/AmFilterInitializer.html...>
Generating <https://builds.apache.org/job/Hadoop-Yarn-trunk/ws/hadoop-yarn-project/hadoop-yarn/hadoop-yarn-server/hadoop-yarn-server-web-proxy/target/org/apache/hadoop/yarn/server/webproxy/amfilter/class-use/AmIpServletRequestWrapper.html...>
Generating <https://builds.apache.org/job/Hadoop-Yarn-trunk/ws/hadoop-yarn-project/hadoop-yarn/hadoop-yarn-server/hadoop-yarn-server-web-proxy/target/org/apache/hadoop/yarn/server/webproxy/amfilter/class-use/AmIpPrincipal.html...>
Generating <https://builds.apache.org/job/Hadoop-Yarn-trunk/ws/hadoop-yarn-project/hadoop-yarn/hadoop-yarn-server/hadoop-yarn-server-web-proxy/target/org/apache/hadoop/yarn/server/webproxy/package-use.html...>
Generating <https://builds.apache.org/job/Hadoop-Yarn-trunk/ws/hadoop-yarn-project/hadoop-yarn/hadoop-yarn-server/hadoop-yarn-server-web-proxy/target/org/apache/hadoop/yarn/server/webproxy/amfilter/package-use.html...>
Building index for all the packages and classes...
Generating <https://builds.apache.org/job/Hadoop-Yarn-trunk/ws/hadoop-yarn-project/hadoop-yarn/hadoop-yarn-server/hadoop-yarn-server-web-proxy/target/overview-tree.html...>
Generating <https://builds.apache.org/job/Hadoop-Yarn-trunk/ws/hadoop-yarn-project/hadoop-yarn/hadoop-yarn-server/hadoop-yarn-server-web-proxy/target/index-all.html...>
Generating <https://builds.apache.org/job/Hadoop-Yarn-trunk/ws/hadoop-yarn-project/hadoop-yarn/hadoop-yarn-server/hadoop-yarn-server-web-proxy/target/deprecated-list.html...>
Building index for all classes...
Generating <https://builds.apache.org/job/Hadoop-Yarn-trunk/ws/hadoop-yarn-project/hadoop-yarn/hadoop-yarn-server/hadoop-yarn-server-web-proxy/target/allclasses-frame.html...>
Generating <https://builds.apache.org/job/Hadoop-Yarn-trunk/ws/hadoop-yarn-project/hadoop-yarn/hadoop-yarn-server/hadoop-yarn-server-web-proxy/target/allclasses-noframe.html...>
Generating <https://builds.apache.org/job/Hadoop-Yarn-trunk/ws/hadoop-yarn-project/hadoop-yarn/hadoop-yarn-server/hadoop-yarn-server-web-proxy/target/index.html...>
Generating <https://builds.apache.org/job/Hadoop-Yarn-trunk/ws/hadoop-yarn-project/hadoop-yarn/hadoop-yarn-server/hadoop-yarn-server-web-proxy/target/overview-summary.html...>
Generating <https://builds.apache.org/job/Hadoop-Yarn-trunk/ws/hadoop-yarn-project/hadoop-yarn/hadoop-yarn-server/hadoop-yarn-server-web-proxy/target/help-doc.html...>
[INFO] Building jar: <https://builds.apache.org/job/Hadoop-Yarn-trunk/ws/hadoop-yarn-project/hadoop-yarn/hadoop-yarn-server/hadoop-yarn-server-web-proxy/target/hadoop-yarn-server-web-proxy-3.0.0-SNAPSHOT-javadoc.jar>
[INFO] 
[INFO] --- maven-enforcer-plugin:1.3.1:enforce (depcheck) @ hadoop-yarn-server-web-proxy ---
[INFO] 
[INFO] --- maven-checkstyle-plugin:2.15:checkstyle (default-cli) @ hadoop-yarn-server-web-proxy
---
[INFO] There are 64 errors reported by Checkstyle 6.6 with checkstyle/checkstyle.xml ruleset.
[WARNING] Unable to locate Source XRef to link to - DISABLED
[INFO] 
[INFO] --- findbugs-maven-plugin:3.0.0:findbugs (default-cli) @ hadoop-yarn-server-web-proxy
---
[INFO] Fork Value is true
[INFO] Done FindBugs Analysis....
[INFO]                                                                         
[INFO] ------------------------------------------------------------------------
[INFO] Building Apache Hadoop YARN ApplicationHistoryService 3.0.0-SNAPSHOT
[INFO] ------------------------------------------------------------------------
[INFO] 
[INFO] --- maven-clean-plugin:2.5:clean (default-clean) @ hadoop-yarn-server-applicationhistoryservice
---
[INFO] Deleting <https://builds.apache.org/job/Hadoop-Yarn-trunk/ws/hadoop-yarn-project/hadoop-yarn/hadoop-yarn-server/hadoop-yarn-server-applicationhistoryservice/target>
[INFO] 
[INFO] --- maven-antrun-plugin:1.7:run (create-testdirs) @ hadoop-yarn-server-applicationhistoryservice
---
[INFO] Executing tasks

main:
    [mkdir] Created dir: <https://builds.apache.org/job/Hadoop-Yarn-trunk/ws/hadoop-yarn-project/hadoop-yarn/hadoop-yarn-server/hadoop-yarn-server-applicationhistoryservice/target/test-dir>
[INFO] Executed tasks
[INFO] 
[INFO] --- hadoop-maven-plugins:3.0.0-SNAPSHOT:protoc (compile-protoc) @ hadoop-yarn-server-applicationhistoryservice
---
[INFO] 
[INFO] --- maven-resources-plugin:2.6:resources (default-resources) @ hadoop-yarn-server-applicationhistoryservice
---
[INFO] Using 'UTF-8' encoding to copy filtered resources.
[INFO] skip non existing resourceDirectory <https://builds.apache.org/job/Hadoop-Yarn-trunk/ws/hadoop-yarn-project/hadoop-yarn/hadoop-yarn-server/hadoop-yarn-server-applicationhistoryservice/src/main/resources>
[INFO] 
[INFO] --- maven-compiler-plugin:3.1:compile (default-compile) @ hadoop-yarn-server-applicationhistoryservice
---
[INFO] Changes detected - recompiling the module!
[INFO] Compiling 65 source files to <https://builds.apache.org/job/Hadoop-Yarn-trunk/ws/hadoop-yarn-project/hadoop-yarn/hadoop-yarn-server/hadoop-yarn-server-applicationhistoryservice/target/classes>
[INFO] 
[INFO] --- maven-resources-plugin:2.6:testResources (default-testResources) @ hadoop-yarn-server-applicationhistoryservice
---
[INFO] Using 'UTF-8' encoding to copy filtered resources.
[INFO] skip non existing resourceDirectory <https://builds.apache.org/job/Hadoop-Yarn-trunk/ws/hadoop-yarn-project/hadoop-yarn/hadoop-yarn-server/hadoop-yarn-server-applicationhistoryservice/src/test/resources>
[INFO] 
[INFO] --- maven-compiler-plugin:3.1:testCompile (default-testCompile) @ hadoop-yarn-server-applicationhistoryservice
---
[INFO] Changes detected - recompiling the module!
[INFO] Compiling 24 source files to <https://builds.apache.org/job/Hadoop-Yarn-trunk/ws/hadoop-yarn-project/hadoop-yarn/hadoop-yarn-server/hadoop-yarn-server-applicationhistoryservice/target/test-classes>
[INFO] 
[INFO] --- maven-surefire-plugin:2.17:test (default-test) @ hadoop-yarn-server-applicationhistoryservice
---
[INFO] Surefire report directory: <https://builds.apache.org/job/Hadoop-Yarn-trunk/ws/hadoop-yarn-project/hadoop-yarn/hadoop-yarn-server/hadoop-yarn-server-applicationhistoryservice/target/surefire-reports>

-------------------------------------------------------
 T E S T S
-------------------------------------------------------

-------------------------------------------------------
 T E S T S
-------------------------------------------------------
Running org.apache.hadoop.yarn.server.applicationhistoryservice.TestMemoryApplicationHistoryStore
Tests run: 4, Failures: 0, Errors: 0, Skipped: 0, Time elapsed: 1.619 sec - in org.apache.hadoop.yarn.server.applicationhistoryservice.TestMemoryApplicationHistoryStore
Running org.apache.hadoop.yarn.server.applicationhistoryservice.TestApplicationHistoryManagerImpl
Tests run: 1, Failures: 0, Errors: 0, Skipped: 0, Time elapsed: 0.646 sec - in org.apache.hadoop.yarn.server.applicationhistoryservice.TestApplicationHistoryManagerImpl
Running org.apache.hadoop.yarn.server.applicationhistoryservice.TestApplicationHistoryClientService
Tests run: 9, Failures: 0, Errors: 0, Skipped: 0, Time elapsed: 1.174 sec - in org.apache.hadoop.yarn.server.applicationhistoryservice.TestApplicationHistoryClientService
Running org.apache.hadoop.yarn.server.applicationhistoryservice.TestApplicationHistoryServer
Tests run: 4, Failures: 0, Errors: 0, Skipped: 0, Time elapsed: 4.684 sec - in org.apache.hadoop.yarn.server.applicationhistoryservice.TestApplicationHistoryServer
Running org.apache.hadoop.yarn.server.applicationhistoryservice.TestApplicationHistoryManagerOnTimelineStore
Tests run: 40, Failures: 0, Errors: 0, Skipped: 0, Time elapsed: 2.301 sec - in org.apache.hadoop.yarn.server.applicationhistoryservice.TestApplicationHistoryManagerOnTimelineStore
Running org.apache.hadoop.yarn.server.applicationhistoryservice.TestFileSystemApplicationHistoryStore
Tests run: 7, Failures: 0, Errors: 0, Skipped: 0, Time elapsed: 19.472 sec - in org.apache.hadoop.yarn.server.applicationhistoryservice.TestFileSystemApplicationHistoryStore
Running org.apache.hadoop.yarn.server.applicationhistoryservice.webapp.TestAHSWebApp
Tests run: 6, Failures: 0, Errors: 0, Skipped: 0, Time elapsed: 5.384 sec - in org.apache.hadoop.yarn.server.applicationhistoryservice.webapp.TestAHSWebApp
Running org.apache.hadoop.yarn.server.applicationhistoryservice.webapp.TestAHSWebServices
Tests run: 26, Failures: 4, Errors: 0, Skipped: 0, Time elapsed: 10.231 sec <<< FAILURE!
- in org.apache.hadoop.yarn.server.applicationhistoryservice.webapp.TestAHSWebServices
testAppsQuery[0](org.apache.hadoop.yarn.server.applicationhistoryservice.webapp.TestAHSWebServices)
 Time elapsed: 0.272 sec  <<< FAILURE!
java.lang.AssertionError: incorrect number of elements expected:<1> but was:<2>
	at org.junit.Assert.fail(Assert.java:88)
	at org.junit.Assert.failNotEquals(Assert.java:743)
	at org.junit.Assert.assertEquals(Assert.java:118)
	at org.junit.Assert.assertEquals(Assert.java:555)
	at org.apache.hadoop.yarn.server.applicationhistoryservice.webapp.TestAHSWebServices.testAppsQuery(TestAHSWebServices.java:320)

testSingleApp[0](org.apache.hadoop.yarn.server.applicationhistoryservice.webapp.TestAHSWebServices)
 Time elapsed: 0.212 sec  <<< FAILURE!
java.lang.AssertionError: incorrect number of elements expected:<1> but was:<2>
	at org.junit.Assert.fail(Assert.java:88)
	at org.junit.Assert.failNotEquals(Assert.java:743)
	at org.junit.Assert.assertEquals(Assert.java:118)
	at org.junit.Assert.assertEquals(Assert.java:555)
	at org.apache.hadoop.yarn.server.applicationhistoryservice.webapp.TestAHSWebServices.testSingleApp(TestAHSWebServices.java:339)

testAppsQuery[1](org.apache.hadoop.yarn.server.applicationhistoryservice.webapp.TestAHSWebServices)
 Time elapsed: 0.198 sec  <<< FAILURE!
java.lang.AssertionError: incorrect number of elements expected:<1> but was:<2>
	at org.junit.Assert.fail(Assert.java:88)
	at org.junit.Assert.failNotEquals(Assert.java:743)
	at org.junit.Assert.assertEquals(Assert.java:118)
	at org.junit.Assert.assertEquals(Assert.java:555)
	at org.apache.hadoop.yarn.server.applicationhistoryservice.webapp.TestAHSWebServices.testAppsQuery(TestAHSWebServices.java:320)

testSingleApp[1](org.apache.hadoop.yarn.server.applicationhistoryservice.webapp.TestAHSWebServices)
 Time elapsed: 0.158 sec  <<< FAILURE!
java.lang.AssertionError: incorrect number of elements expected:<1> but was:<2>
	at org.junit.Assert.fail(Assert.java:88)
	at org.junit.Assert.failNotEquals(Assert.java:743)
	at org.junit.Assert.assertEquals(Assert.java:118)
	at org.junit.Assert.assertEquals(Assert.java:555)
	at org.apache.hadoop.yarn.server.applicationhistoryservice.webapp.TestAHSWebServices.testSingleApp(TestAHSWebServices.java:339)

Running org.apache.hadoop.yarn.server.timeline.TestGenericObjectMapper
Tests run: 2, Failures: 0, Errors: 0, Skipped: 0, Time elapsed: 0.485 sec - in org.apache.hadoop.yarn.server.timeline.TestGenericObjectMapper
Running org.apache.hadoop.yarn.server.timeline.TestMemoryTimelineStore
Tests run: 9, Failures: 0, Errors: 0, Skipped: 0, Time elapsed: 9.281 sec - in org.apache.hadoop.yarn.server.timeline.TestMemoryTimelineStore
Running org.apache.hadoop.yarn.server.timeline.security.TestTimelineACLsManager
Tests run: 6, Failures: 0, Errors: 0, Skipped: 0, Time elapsed: 1.106 sec - in org.apache.hadoop.yarn.server.timeline.security.TestTimelineACLsManager
Running org.apache.hadoop.yarn.server.timeline.security.TestTimelineAuthenticationFilter
Tests run: 6, Failures: 0, Errors: 0, Skipped: 0, Time elapsed: 10.689 sec - in org.apache.hadoop.yarn.server.timeline.security.TestTimelineAuthenticationFilter
Running org.apache.hadoop.yarn.server.timeline.security.TestTimelineAuthenticationFilterInitializer
Tests run: 1, Failures: 0, Errors: 0, Skipped: 0, Time elapsed: 0.78 sec - in org.apache.hadoop.yarn.server.timeline.security.TestTimelineAuthenticationFilterInitializer
Running org.apache.hadoop.yarn.server.timeline.recovery.TestLeveldbTimelineStateStore
Tests run: 2, Failures: 0, Errors: 0, Skipped: 0, Time elapsed: 1.169 sec - in org.apache.hadoop.yarn.server.timeline.recovery.TestLeveldbTimelineStateStore
Running org.apache.hadoop.yarn.server.timeline.TestTimelineDataManager
Tests run: 4, Failures: 0, Errors: 0, Skipped: 0, Time elapsed: 5.673 sec - in org.apache.hadoop.yarn.server.timeline.TestTimelineDataManager
Running org.apache.hadoop.yarn.server.timeline.TestLeveldbTimelineStore
Tests run: 19, Failures: 0, Errors: 0, Skipped: 0, Time elapsed: 21.618 sec - in org.apache.hadoop.yarn.server.timeline.TestLeveldbTimelineStore
Running org.apache.hadoop.yarn.server.timeline.TestRollingLevelDBTimelineStore
Tests run: 16, Failures: 0, Errors: 0, Skipped: 0, Time elapsed: 18.757 sec - in org.apache.hadoop.yarn.server.timeline.TestRollingLevelDBTimelineStore
Running org.apache.hadoop.yarn.server.timeline.TestRollingLevelDB
Tests run: 2, Failures: 0, Errors: 0, Skipped: 0, Time elapsed: 1.184 sec - in org.apache.hadoop.yarn.server.timeline.TestRollingLevelDB
Running org.apache.hadoop.yarn.server.timeline.webapp.TestCrossOriginFilter
Tests run: 9, Failures: 0, Errors: 0, Skipped: 0, Time elapsed: 0.452 sec - in org.apache.hadoop.yarn.server.timeline.webapp.TestCrossOriginFilter
Running org.apache.hadoop.yarn.server.timeline.webapp.TestTimelineWebServices
Tests run: 27, Failures: 0, Errors: 0, Skipped: 0, Time elapsed: 38.306 sec - in org.apache.hadoop.yarn.server.timeline.webapp.TestTimelineWebServices
Running org.apache.hadoop.yarn.server.timeline.webapp.TestTimelineWebServicesWithSSL
Tests run: 1, Failures: 0, Errors: 0, Skipped: 0, Time elapsed: 4.624 sec - in org.apache.hadoop.yarn.server.timeline.webapp.TestTimelineWebServicesWithSSL
Running org.apache.hadoop.yarn.server.timeline.webapp.TestCrossOriginFilterInitializer
Tests run: 1, Failures: 0, Errors: 0, Skipped: 0, Time elapsed: 0.329 sec - in org.apache.hadoop.yarn.server.timeline.webapp.TestCrossOriginFilterInitializer

Results :

Failed tests: 
  TestAHSWebServices.testAppsQuery:320 incorrect number of elements expected:<1> but
was:<2>
  TestAHSWebServices.testSingleApp:339 incorrect number of elements expected:<1> but
was:<2>
  TestAHSWebServices.testAppsQuery:320 incorrect number of elements expected:<1> but
was:<2>
  TestAHSWebServices.testSingleApp:339 incorrect number of elements expected:<1> but
was:<2>

Tests run: 202, Failures: 4, Errors: 0, Skipped: 0

[INFO] ------------------------------------------------------------------------
[INFO] Reactor Summary:
[INFO] 
[INFO] Apache Hadoop YARN ................................ SUCCESS [  3.091 s]
[INFO] Apache Hadoop YARN API ............................ SUCCESS [03:37 min]
[INFO] Apache Hadoop YARN Common ......................... SUCCESS [02:54 min]
[INFO] Apache Hadoop YARN Server ......................... SUCCESS [  0.085 s]
[INFO] Apache Hadoop YARN Server Common .................. SUCCESS [ 41.118 s]
[INFO] Apache Hadoop YARN NodeManager .................... SUCCESS [06:31 min]
[INFO] Apache Hadoop YARN Web Proxy ...................... SUCCESS [ 23.066 s]
[INFO] Apache Hadoop YARN ApplicationHistoryService ...... FAILURE [02:47 min]
[INFO] Apache Hadoop YARN ResourceManager ................ SKIPPED
[INFO] Apache Hadoop YARN Server Tests ................... SKIPPED
[INFO] Apache Hadoop YARN Client ......................... SKIPPED
[INFO] Apache Hadoop YARN SharedCacheManager ............. SKIPPED
[INFO] Apache Hadoop YARN Applications ................... SKIPPED
[INFO] Apache Hadoop YARN DistributedShell ............... SKIPPED
[INFO] Apache Hadoop YARN Unmanaged Am Launcher .......... SKIPPED
[INFO] Apache Hadoop YARN Site ........................... SKIPPED
[INFO] Apache Hadoop YARN Registry ....................... SKIPPED
[INFO] Apache Hadoop YARN Project ........................ SKIPPED
[INFO] ------------------------------------------------------------------------
[INFO] BUILD FAILURE
[INFO] ------------------------------------------------------------------------
[INFO] Total time: 16:59 min
[INFO] Finished at: 2015-06-01T10:48:55+00:00
[INFO] Final Memory: 87M/1133M
[INFO] ------------------------------------------------------------------------
[ERROR] Failed to execute goal org.apache.maven.plugins:maven-surefire-plugin:2.17:test (default-test)
on project hadoop-yarn-server-applicationhistoryservice: There are test failures.
[ERROR] 
[ERROR] Please refer to <https://builds.apache.org/job/Hadoop-Yarn-trunk/ws/hadoop-yarn-project/hadoop-yarn/hadoop-yarn-server/hadoop-yarn-server-applicationhistoryservice/target/surefire-reports>
for the individual test results.
[ERROR] -> [Help 1]
[ERROR] 
[ERROR] To see the full stack trace of the errors, re-run Maven with the -e switch.
[ERROR] Re-run Maven using the -X switch to enable full debug logging.
[ERROR] 
[ERROR] For more information about the errors and possible solutions, please read the following
articles:
[ERROR] [Help 1] http://cwiki.apache.org/confluence/display/MAVEN/MojoFailureException
[ERROR] 
[ERROR] After correcting the problems, you can resume the build with the command
[ERROR]   mvn <goals> -rf :hadoop-yarn-server-applicationhistoryservice
Build step 'Execute shell' marked build as failure
Archiving artifacts
Recording test results
Updating YARN-3725
Updating YARN-2900
Updating HDFS-8490

Mime
View raw message