hadoop-yarn-dev mailing list archives

Site index · List index
Message view « Date » · « Thread »
Top « Date » · « Thread »
From Apache Jenkins Server <jenk...@builds.apache.org>
Subject Build failed in Jenkins: Hadoop-Yarn-trunk #959
Date Mon, 15 Jun 2015 10:50:02 GMT
See <https://builds.apache.org/job/Hadoop-Yarn-trunk/959/changes>

Changes:

[yzhang] HDFS-8596. TestDistributedFileSystem et al tests are broken in branch-2 due to incorrect
setting of "datanode" attribute. Contributed by Yongjun Zhang.

[arp] HDFS-8595. TestCommitBlockSynchronization fails in branch-2.7. (Patch applies to all
branches). (Contributed by Arpit Agarwal)

------------------------------------------
[...truncated 8392 lines...]
java.lang.UnsupportedOperationException: null
	at org.apache.hadoop.fs.permission.FsPermission$ImmutableFsPermission.applyUMask(FsPermission.java:380)
	at org.apache.hadoop.fs.RawLocalFileSystem.mkOneDirWithMode(RawLocalFileSystem.java:498)
	at org.apache.hadoop.fs.RawLocalFileSystem.mkdirsWithOptionalPermission(RawLocalFileSystem.java:553)
	at org.apache.hadoop.fs.RawLocalFileSystem.mkdirs(RawLocalFileSystem.java:531)
	at org.apache.hadoop.fs.FilterFileSystem.mkdirs(FilterFileSystem.java:314)
	at org.apache.hadoop.yarn.server.timeline.RollingLevelDB.initFileSystem(RollingLevelDB.java:207)
	at org.apache.hadoop.yarn.server.timeline.RollingLevelDB.init(RollingLevelDB.java:200)
	at org.apache.hadoop.yarn.server.timeline.RollingLevelDBTimelineStore.serviceInit(RollingLevelDBTimelineStore.java:321)
	at org.apache.hadoop.service.AbstractService.init(AbstractService.java:163)
	at org.apache.hadoop.yarn.server.timeline.TestRollingLevelDBTimelineStore.setup(TestRollingLevelDBTimelineStore.java:65)

testRelatingToOldEntityWithoutDomainId(org.apache.hadoop.yarn.server.timeline.TestRollingLevelDBTimelineStore)
 Time elapsed: 0.059 sec  <<< ERROR!
java.lang.UnsupportedOperationException: null
	at org.apache.hadoop.fs.permission.FsPermission$ImmutableFsPermission.applyUMask(FsPermission.java:380)
	at org.apache.hadoop.fs.RawLocalFileSystem.mkOneDirWithMode(RawLocalFileSystem.java:498)
	at org.apache.hadoop.fs.RawLocalFileSystem.mkdirsWithOptionalPermission(RawLocalFileSystem.java:553)
	at org.apache.hadoop.fs.RawLocalFileSystem.mkdirs(RawLocalFileSystem.java:531)
	at org.apache.hadoop.fs.FilterFileSystem.mkdirs(FilterFileSystem.java:314)
	at org.apache.hadoop.yarn.server.timeline.RollingLevelDB.initFileSystem(RollingLevelDB.java:207)
	at org.apache.hadoop.yarn.server.timeline.RollingLevelDB.init(RollingLevelDB.java:200)
	at org.apache.hadoop.yarn.server.timeline.RollingLevelDBTimelineStore.serviceInit(RollingLevelDBTimelineStore.java:321)
	at org.apache.hadoop.service.AbstractService.init(AbstractService.java:163)
	at org.apache.hadoop.yarn.server.timeline.TestRollingLevelDBTimelineStore.setup(TestRollingLevelDBTimelineStore.java:65)

testRootDirPermission(org.apache.hadoop.yarn.server.timeline.TestRollingLevelDBTimelineStore)
 Time elapsed: 0.048 sec  <<< ERROR!
java.lang.UnsupportedOperationException: null
	at org.apache.hadoop.fs.permission.FsPermission$ImmutableFsPermission.applyUMask(FsPermission.java:380)
	at org.apache.hadoop.fs.RawLocalFileSystem.mkOneDirWithMode(RawLocalFileSystem.java:498)
	at org.apache.hadoop.fs.RawLocalFileSystem.mkdirsWithOptionalPermission(RawLocalFileSystem.java:553)
	at org.apache.hadoop.fs.RawLocalFileSystem.mkdirs(RawLocalFileSystem.java:531)
	at org.apache.hadoop.fs.FilterFileSystem.mkdirs(FilterFileSystem.java:314)
	at org.apache.hadoop.yarn.server.timeline.RollingLevelDB.initFileSystem(RollingLevelDB.java:207)
	at org.apache.hadoop.yarn.server.timeline.RollingLevelDB.init(RollingLevelDB.java:200)
	at org.apache.hadoop.yarn.server.timeline.RollingLevelDBTimelineStore.serviceInit(RollingLevelDBTimelineStore.java:321)
	at org.apache.hadoop.service.AbstractService.init(AbstractService.java:163)
	at org.apache.hadoop.yarn.server.timeline.TestRollingLevelDBTimelineStore.setup(TestRollingLevelDBTimelineStore.java:65)

testGetSingleEntity(org.apache.hadoop.yarn.server.timeline.TestRollingLevelDBTimelineStore)
 Time elapsed: 0.05 sec  <<< ERROR!
java.lang.UnsupportedOperationException: null
	at org.apache.hadoop.fs.permission.FsPermission$ImmutableFsPermission.applyUMask(FsPermission.java:380)
	at org.apache.hadoop.fs.RawLocalFileSystem.mkOneDirWithMode(RawLocalFileSystem.java:498)
	at org.apache.hadoop.fs.RawLocalFileSystem.mkdirsWithOptionalPermission(RawLocalFileSystem.java:553)
	at org.apache.hadoop.fs.RawLocalFileSystem.mkdirs(RawLocalFileSystem.java:531)
	at org.apache.hadoop.fs.FilterFileSystem.mkdirs(FilterFileSystem.java:314)
	at org.apache.hadoop.yarn.server.timeline.RollingLevelDB.initFileSystem(RollingLevelDB.java:207)
	at org.apache.hadoop.yarn.server.timeline.RollingLevelDB.init(RollingLevelDB.java:200)
	at org.apache.hadoop.yarn.server.timeline.RollingLevelDBTimelineStore.serviceInit(RollingLevelDBTimelineStore.java:321)
	at org.apache.hadoop.service.AbstractService.init(AbstractService.java:163)
	at org.apache.hadoop.yarn.server.timeline.TestRollingLevelDBTimelineStore.setup(TestRollingLevelDBTimelineStore.java:65)

testCacheSizes(org.apache.hadoop.yarn.server.timeline.TestRollingLevelDBTimelineStore)  Time
elapsed: 0.047 sec  <<< ERROR!
java.lang.UnsupportedOperationException: null
	at org.apache.hadoop.fs.permission.FsPermission$ImmutableFsPermission.applyUMask(FsPermission.java:380)
	at org.apache.hadoop.fs.RawLocalFileSystem.mkOneDirWithMode(RawLocalFileSystem.java:498)
	at org.apache.hadoop.fs.RawLocalFileSystem.mkdirsWithOptionalPermission(RawLocalFileSystem.java:553)
	at org.apache.hadoop.fs.RawLocalFileSystem.mkdirs(RawLocalFileSystem.java:531)
	at org.apache.hadoop.fs.FilterFileSystem.mkdirs(FilterFileSystem.java:314)
	at org.apache.hadoop.yarn.server.timeline.RollingLevelDB.initFileSystem(RollingLevelDB.java:207)
	at org.apache.hadoop.yarn.server.timeline.RollingLevelDB.init(RollingLevelDB.java:200)
	at org.apache.hadoop.yarn.server.timeline.RollingLevelDBTimelineStore.serviceInit(RollingLevelDBTimelineStore.java:321)
	at org.apache.hadoop.service.AbstractService.init(AbstractService.java:163)
	at org.apache.hadoop.yarn.server.timeline.TestRollingLevelDBTimelineStore.setup(TestRollingLevelDBTimelineStore.java:65)

testGetEntities(org.apache.hadoop.yarn.server.timeline.TestRollingLevelDBTimelineStore)  Time
elapsed: 0.054 sec  <<< ERROR!
java.lang.UnsupportedOperationException: null
	at org.apache.hadoop.fs.permission.FsPermission$ImmutableFsPermission.applyUMask(FsPermission.java:380)
	at org.apache.hadoop.fs.RawLocalFileSystem.mkOneDirWithMode(RawLocalFileSystem.java:498)
	at org.apache.hadoop.fs.RawLocalFileSystem.mkdirsWithOptionalPermission(RawLocalFileSystem.java:553)
	at org.apache.hadoop.fs.RawLocalFileSystem.mkdirs(RawLocalFileSystem.java:531)
	at org.apache.hadoop.fs.FilterFileSystem.mkdirs(FilterFileSystem.java:314)
	at org.apache.hadoop.yarn.server.timeline.RollingLevelDB.initFileSystem(RollingLevelDB.java:207)
	at org.apache.hadoop.yarn.server.timeline.RollingLevelDB.init(RollingLevelDB.java:200)
	at org.apache.hadoop.yarn.server.timeline.RollingLevelDBTimelineStore.serviceInit(RollingLevelDBTimelineStore.java:321)
	at org.apache.hadoop.service.AbstractService.init(AbstractService.java:163)
	at org.apache.hadoop.yarn.server.timeline.TestRollingLevelDBTimelineStore.setup(TestRollingLevelDBTimelineStore.java:65)

testRelatingToEntityInSamePut(org.apache.hadoop.yarn.server.timeline.TestRollingLevelDBTimelineStore)
 Time elapsed: 0.046 sec  <<< ERROR!
java.lang.UnsupportedOperationException: null
	at org.apache.hadoop.fs.permission.FsPermission$ImmutableFsPermission.applyUMask(FsPermission.java:380)
	at org.apache.hadoop.fs.RawLocalFileSystem.mkOneDirWithMode(RawLocalFileSystem.java:498)
	at org.apache.hadoop.fs.RawLocalFileSystem.mkdirsWithOptionalPermission(RawLocalFileSystem.java:553)
	at org.apache.hadoop.fs.RawLocalFileSystem.mkdirs(RawLocalFileSystem.java:531)
	at org.apache.hadoop.fs.FilterFileSystem.mkdirs(FilterFileSystem.java:314)
	at org.apache.hadoop.yarn.server.timeline.RollingLevelDB.initFileSystem(RollingLevelDB.java:207)
	at org.apache.hadoop.yarn.server.timeline.RollingLevelDB.init(RollingLevelDB.java:200)
	at org.apache.hadoop.yarn.server.timeline.RollingLevelDBTimelineStore.serviceInit(RollingLevelDBTimelineStore.java:321)
	at org.apache.hadoop.service.AbstractService.init(AbstractService.java:163)
	at org.apache.hadoop.yarn.server.timeline.TestRollingLevelDBTimelineStore.setup(TestRollingLevelDBTimelineStore.java:65)

testGetDomain(org.apache.hadoop.yarn.server.timeline.TestRollingLevelDBTimelineStore)  Time
elapsed: 0.049 sec  <<< ERROR!
java.lang.UnsupportedOperationException: null
	at org.apache.hadoop.fs.permission.FsPermission$ImmutableFsPermission.applyUMask(FsPermission.java:380)
	at org.apache.hadoop.fs.RawLocalFileSystem.mkOneDirWithMode(RawLocalFileSystem.java:498)
	at org.apache.hadoop.fs.RawLocalFileSystem.mkdirsWithOptionalPermission(RawLocalFileSystem.java:553)
	at org.apache.hadoop.fs.RawLocalFileSystem.mkdirs(RawLocalFileSystem.java:531)
	at org.apache.hadoop.fs.FilterFileSystem.mkdirs(FilterFileSystem.java:314)
	at org.apache.hadoop.yarn.server.timeline.RollingLevelDB.initFileSystem(RollingLevelDB.java:207)
	at org.apache.hadoop.yarn.server.timeline.RollingLevelDB.init(RollingLevelDB.java:200)
	at org.apache.hadoop.yarn.server.timeline.RollingLevelDBTimelineStore.serviceInit(RollingLevelDBTimelineStore.java:321)
	at org.apache.hadoop.service.AbstractService.init(AbstractService.java:163)
	at org.apache.hadoop.yarn.server.timeline.TestRollingLevelDBTimelineStore.setup(TestRollingLevelDBTimelineStore.java:65)

testGetEvents(org.apache.hadoop.yarn.server.timeline.TestRollingLevelDBTimelineStore)  Time
elapsed: 0.044 sec  <<< ERROR!
java.lang.UnsupportedOperationException: null
	at org.apache.hadoop.fs.permission.FsPermission$ImmutableFsPermission.applyUMask(FsPermission.java:380)
	at org.apache.hadoop.fs.RawLocalFileSystem.mkOneDirWithMode(RawLocalFileSystem.java:498)
	at org.apache.hadoop.fs.RawLocalFileSystem.mkdirsWithOptionalPermission(RawLocalFileSystem.java:553)
	at org.apache.hadoop.fs.RawLocalFileSystem.mkdirs(RawLocalFileSystem.java:531)
	at org.apache.hadoop.fs.FilterFileSystem.mkdirs(FilterFileSystem.java:314)
	at org.apache.hadoop.yarn.server.timeline.RollingLevelDB.initFileSystem(RollingLevelDB.java:207)
	at org.apache.hadoop.yarn.server.timeline.RollingLevelDB.init(RollingLevelDB.java:200)
	at org.apache.hadoop.yarn.server.timeline.RollingLevelDBTimelineStore.serviceInit(RollingLevelDBTimelineStore.java:321)
	at org.apache.hadoop.service.AbstractService.init(AbstractService.java:163)
	at org.apache.hadoop.yarn.server.timeline.TestRollingLevelDBTimelineStore.setup(TestRollingLevelDBTimelineStore.java:65)

testGetEntitiesWithSecondaryFilters(org.apache.hadoop.yarn.server.timeline.TestRollingLevelDBTimelineStore)
 Time elapsed: 0.044 sec  <<< ERROR!
java.lang.UnsupportedOperationException: null
	at org.apache.hadoop.fs.permission.FsPermission$ImmutableFsPermission.applyUMask(FsPermission.java:380)
	at org.apache.hadoop.fs.RawLocalFileSystem.mkOneDirWithMode(RawLocalFileSystem.java:498)
	at org.apache.hadoop.fs.RawLocalFileSystem.mkdirsWithOptionalPermission(RawLocalFileSystem.java:553)
	at org.apache.hadoop.fs.RawLocalFileSystem.mkdirs(RawLocalFileSystem.java:531)
	at org.apache.hadoop.fs.FilterFileSystem.mkdirs(FilterFileSystem.java:314)
	at org.apache.hadoop.yarn.server.timeline.RollingLevelDB.initFileSystem(RollingLevelDB.java:207)
	at org.apache.hadoop.yarn.server.timeline.RollingLevelDB.init(RollingLevelDB.java:200)
	at org.apache.hadoop.yarn.server.timeline.RollingLevelDBTimelineStore.serviceInit(RollingLevelDBTimelineStore.java:321)
	at org.apache.hadoop.service.AbstractService.init(AbstractService.java:163)
	at org.apache.hadoop.yarn.server.timeline.TestRollingLevelDBTimelineStore.setup(TestRollingLevelDBTimelineStore.java:65)

testCheckVersion(org.apache.hadoop.yarn.server.timeline.TestRollingLevelDBTimelineStore) 
Time elapsed: 0.039 sec  <<< ERROR!
java.lang.UnsupportedOperationException: null
	at org.apache.hadoop.fs.permission.FsPermission$ImmutableFsPermission.applyUMask(FsPermission.java:380)
	at org.apache.hadoop.fs.RawLocalFileSystem.mkOneDirWithMode(RawLocalFileSystem.java:498)
	at org.apache.hadoop.fs.RawLocalFileSystem.mkdirsWithOptionalPermission(RawLocalFileSystem.java:553)
	at org.apache.hadoop.fs.RawLocalFileSystem.mkdirs(RawLocalFileSystem.java:531)
	at org.apache.hadoop.fs.FilterFileSystem.mkdirs(FilterFileSystem.java:314)
	at org.apache.hadoop.yarn.server.timeline.RollingLevelDB.initFileSystem(RollingLevelDB.java:207)
	at org.apache.hadoop.yarn.server.timeline.RollingLevelDB.init(RollingLevelDB.java:200)
	at org.apache.hadoop.yarn.server.timeline.RollingLevelDBTimelineStore.serviceInit(RollingLevelDBTimelineStore.java:321)
	at org.apache.hadoop.service.AbstractService.init(AbstractService.java:163)
	at org.apache.hadoop.yarn.server.timeline.TestRollingLevelDBTimelineStore.setup(TestRollingLevelDBTimelineStore.java:65)

testGetEntitiesWithFromId(org.apache.hadoop.yarn.server.timeline.TestRollingLevelDBTimelineStore)
 Time elapsed: 0.044 sec  <<< ERROR!
java.lang.UnsupportedOperationException: null
	at org.apache.hadoop.fs.permission.FsPermission$ImmutableFsPermission.applyUMask(FsPermission.java:380)
	at org.apache.hadoop.fs.RawLocalFileSystem.mkOneDirWithMode(RawLocalFileSystem.java:498)
	at org.apache.hadoop.fs.RawLocalFileSystem.mkdirsWithOptionalPermission(RawLocalFileSystem.java:553)
	at org.apache.hadoop.fs.RawLocalFileSystem.mkdirs(RawLocalFileSystem.java:531)
	at org.apache.hadoop.fs.FilterFileSystem.mkdirs(FilterFileSystem.java:314)
	at org.apache.hadoop.yarn.server.timeline.RollingLevelDB.initFileSystem(RollingLevelDB.java:207)
	at org.apache.hadoop.yarn.server.timeline.RollingLevelDB.init(RollingLevelDB.java:200)
	at org.apache.hadoop.yarn.server.timeline.RollingLevelDBTimelineStore.serviceInit(RollingLevelDBTimelineStore.java:321)
	at org.apache.hadoop.service.AbstractService.init(AbstractService.java:163)
	at org.apache.hadoop.yarn.server.timeline.TestRollingLevelDBTimelineStore.setup(TestRollingLevelDBTimelineStore.java:65)

testGetEntitiesWithFromTs(org.apache.hadoop.yarn.server.timeline.TestRollingLevelDBTimelineStore)
 Time elapsed: 0.053 sec  <<< ERROR!
java.lang.UnsupportedOperationException: null
	at org.apache.hadoop.fs.permission.FsPermission$ImmutableFsPermission.applyUMask(FsPermission.java:380)
	at org.apache.hadoop.fs.RawLocalFileSystem.mkOneDirWithMode(RawLocalFileSystem.java:498)
	at org.apache.hadoop.fs.RawLocalFileSystem.mkdirsWithOptionalPermission(RawLocalFileSystem.java:553)
	at org.apache.hadoop.fs.RawLocalFileSystem.mkdirs(RawLocalFileSystem.java:531)
	at org.apache.hadoop.fs.FilterFileSystem.mkdirs(FilterFileSystem.java:314)
	at org.apache.hadoop.yarn.server.timeline.RollingLevelDB.initFileSystem(RollingLevelDB.java:207)
	at org.apache.hadoop.yarn.server.timeline.RollingLevelDB.init(RollingLevelDB.java:200)
	at org.apache.hadoop.yarn.server.timeline.RollingLevelDBTimelineStore.serviceInit(RollingLevelDBTimelineStore.java:321)
	at org.apache.hadoop.service.AbstractService.init(AbstractService.java:163)
	at org.apache.hadoop.yarn.server.timeline.TestRollingLevelDBTimelineStore.setup(TestRollingLevelDBTimelineStore.java:65)

Running org.apache.hadoop.yarn.server.timeline.webapp.TestCrossOriginFilterInitializer
Tests run: 1, Failures: 0, Errors: 0, Skipped: 0, Time elapsed: 0.421 sec - in org.apache.hadoop.yarn.server.timeline.webapp.TestCrossOriginFilterInitializer
Running org.apache.hadoop.yarn.server.timeline.webapp.TestTimelineWebServices
Tests run: 27, Failures: 0, Errors: 0, Skipped: 0, Time elapsed: 39.54 sec - in org.apache.hadoop.yarn.server.timeline.webapp.TestTimelineWebServices
Running org.apache.hadoop.yarn.server.timeline.webapp.TestTimelineWebServicesWithSSL
Tests run: 1, Failures: 0, Errors: 0, Skipped: 0, Time elapsed: 5.259 sec - in org.apache.hadoop.yarn.server.timeline.webapp.TestTimelineWebServicesWithSSL
Running org.apache.hadoop.yarn.server.timeline.webapp.TestCrossOriginFilter
Tests run: 9, Failures: 0, Errors: 0, Skipped: 0, Time elapsed: 0.517 sec - in org.apache.hadoop.yarn.server.timeline.webapp.TestCrossOriginFilter
Running org.apache.hadoop.yarn.server.timeline.recovery.TestLeveldbTimelineStateStore
Tests run: 2, Failures: 0, Errors: 0, Skipped: 0, Time elapsed: 1.326 sec - in org.apache.hadoop.yarn.server.timeline.recovery.TestLeveldbTimelineStateStore

Results :

Tests in error: 
  TestRollingLevelDB.testInsertForPreviousPeriodAfterRollPeriodRollsDB:90 » UnsupportedOperation
  TestRollingLevelDB.testInsertAfterRollPeriodRollsDB:70 » UnsupportedOperation
  TestRollingLevelDBTimelineStore.setup:65 » UnsupportedOperation
  TestRollingLevelDBTimelineStore.setup:65 » UnsupportedOperation
  TestRollingLevelDBTimelineStore.setup:65 » UnsupportedOperation
  TestRollingLevelDBTimelineStore.setup:65 » UnsupportedOperation
  TestRollingLevelDBTimelineStore.setup:65 » UnsupportedOperation
  TestRollingLevelDBTimelineStore.setup:65 » UnsupportedOperation
  TestRollingLevelDBTimelineStore.setup:65 » UnsupportedOperation
  TestRollingLevelDBTimelineStore.setup:65 » UnsupportedOperation
  TestRollingLevelDBTimelineStore.setup:65 » UnsupportedOperation
  TestRollingLevelDBTimelineStore.setup:65 » UnsupportedOperation
  TestRollingLevelDBTimelineStore.setup:65 » UnsupportedOperation
  TestRollingLevelDBTimelineStore.setup:65 » UnsupportedOperation
  TestRollingLevelDBTimelineStore.setup:65 » UnsupportedOperation
  TestRollingLevelDBTimelineStore.setup:65 » UnsupportedOperation
  TestRollingLevelDBTimelineStore.setup:65 » UnsupportedOperation
  TestRollingLevelDBTimelineStore.setup:65 » UnsupportedOperation

Tests run: 202, Failures: 0, Errors: 18, Skipped: 0

[INFO] ------------------------------------------------------------------------
[INFO] Reactor Summary:
[INFO] 
[INFO] Apache Hadoop YARN ................................ SUCCESS [  3.317 s]
[INFO] Apache Hadoop YARN API ............................ SUCCESS [03:36 min]
[INFO] Apache Hadoop YARN Common ......................... SUCCESS [02:57 min]
[INFO] Apache Hadoop YARN Server ......................... SUCCESS [  0.094 s]
[INFO] Apache Hadoop YARN Server Common .................. SUCCESS [ 46.985 s]
[INFO] Apache Hadoop YARN NodeManager .................... SUCCESS [07:11 min]
[INFO] Apache Hadoop YARN Web Proxy ...................... SUCCESS [ 29.286 s]
[INFO] Apache Hadoop YARN ApplicationHistoryService ...... FAILURE [02:45 min]
[INFO] Apache Hadoop YARN ResourceManager ................ SKIPPED
[INFO] Apache Hadoop YARN Server Tests ................... SKIPPED
[INFO] Apache Hadoop YARN Client ......................... SKIPPED
[INFO] Apache Hadoop YARN SharedCacheManager ............. SKIPPED
[INFO] Apache Hadoop YARN Applications ................... SKIPPED
[INFO] Apache Hadoop YARN DistributedShell ............... SKIPPED
[INFO] Apache Hadoop YARN Unmanaged Am Launcher .......... SKIPPED
[INFO] Apache Hadoop YARN Site ........................... SKIPPED
[INFO] Apache Hadoop YARN Registry ....................... SKIPPED
[INFO] Apache Hadoop YARN Project ........................ SKIPPED
[INFO] ------------------------------------------------------------------------
[INFO] BUILD FAILURE
[INFO] ------------------------------------------------------------------------
[INFO] Total time: 17:52 min
[INFO] Finished at: 2015-06-15T10:49:55+00:00
[INFO] Final Memory: 87M/958M
[INFO] ------------------------------------------------------------------------
[ERROR] Failed to execute goal org.apache.maven.plugins:maven-surefire-plugin:2.17:test (default-test)
on project hadoop-yarn-server-applicationhistoryservice: There are test failures.
[ERROR] 
[ERROR] Please refer to <https://builds.apache.org/job/Hadoop-Yarn-trunk/ws/hadoop-yarn-project/hadoop-yarn/hadoop-yarn-server/hadoop-yarn-server-applicationhistoryservice/target/surefire-reports>
for the individual test results.
[ERROR] -> [Help 1]
[ERROR] 
[ERROR] To see the full stack trace of the errors, re-run Maven with the -e switch.
[ERROR] Re-run Maven using the -X switch to enable full debug logging.
[ERROR] 
[ERROR] For more information about the errors and possible solutions, please read the following
articles:
[ERROR] [Help 1] http://cwiki.apache.org/confluence/display/MAVEN/MojoFailureException
[ERROR] 
[ERROR] After correcting the problems, you can resume the build with the command
[ERROR]   mvn <goals> -rf :hadoop-yarn-server-applicationhistoryservice
Build step 'Execute shell' marked build as failure
Archiving artifacts
Recording test results
Updating HDFS-8595
Updating HDFS-8596

Mime
View raw message