hadoop-yarn-dev mailing list archives

Site index · List index
Message view « Date » · « Thread »
Top « Date » · « Thread »
From Apache Jenkins Server <jenk...@builds.apache.org>
Subject Failed: YARN-3381 PreCommit Build #8224
Date Tue, 09 Jun 2015 08:26:37 GMT
Jira: https://issues.apache.org/jira/browse/YARN-3381
Build: https://builds.apache.org/job/PreCommit-YARN-Build/8224/

###################################################################################
########################## LAST 60 LINES OF THE CONSOLE ###########################
[...truncated 423 lines...]
|      |                     |            | hadoop-yarn-server-resourcemanager.
|      |                     |  126m 7s   | 


             Reason | Tests
          FindBugs  |  module:hadoop-yarn-common 
 Failed unit tests  |  hadoop.yarn.server.resourcemanager.scheduler.fair.TestFairScheduler

                    |  hadoop.yarn.server.resourcemanager.security.TestRMDelegationTokens



|| Subsystem || Report/Notes ||
============================================================================
| Patch URL | http://issues.apache.org/jira/secure/attachment/12738512/YARN-3381-004-branch-2.patch
|
| Optional Tests | javadoc javac unit findbugs checkstyle |
| git revision | trunk / c45784b |
| Pre-patch Findbugs warnings | /home/jenkins/jenkins-slave/workspace/PreCommit-YARN-Build/patchprocess/trunkFindbugsWarningshadoop-mapreduce-client-app.html
|
| javac | /home/jenkins/jenkins-slave/workspace/PreCommit-YARN-Build/patchprocess/diffJavacWarnings.txt
|
| checkstyle |  /home/jenkins/jenkins-slave/workspace/PreCommit-YARN-Build/patchprocess/diffcheckstylehadoop-yarn-common.txt
|
| Findbugs warnings | /home/jenkins/jenkins-slave/workspace/PreCommit-YARN-Build/patchprocess/newPatchFindbugsWarningshadoop-yarn-common.html
|
| hadoop-mapreduce-client-app test log | /home/jenkins/jenkins-slave/workspace/PreCommit-YARN-Build/patchprocess/testrun_hadoop-mapreduce-client-app.txt
|
| hadoop-yarn-client test log | /home/jenkins/jenkins-slave/workspace/PreCommit-YARN-Build/patchprocess/testrun_hadoop-yarn-client.txt
|
| hadoop-yarn-common test log | /home/jenkins/jenkins-slave/workspace/PreCommit-YARN-Build/patchprocess/testrun_hadoop-yarn-common.txt
|
| hadoop-yarn-server-nodemanager test log | /home/jenkins/jenkins-slave/workspace/PreCommit-YARN-Build/patchprocess/testrun_hadoop-yarn-server-nodemanager.txt
|
| hadoop-yarn-server-resourcemanager test log | /home/jenkins/jenkins-slave/workspace/PreCommit-YARN-Build/patchprocess/testrun_hadoop-yarn-server-resourcemanager.txt
|
| Test Results | https://builds.apache.org/job/PreCommit-YARN-Build/8224/testReport/ |
| Java | 1.7.0_55 |
| uname | Linux asf903.gq1.ygridcore.net 3.13.0-36-lowlatency #63-Ubuntu SMP PREEMPT Wed Sep
3 21:56:12 UTC 2014 x86_64 x86_64 x86_64 GNU/Linux |


============================================================================
============================================================================
                          Adding comment to JIRA
============================================================================
============================================================================


Comment added.
b492fe7080ecc6fd0e5beedec9e00e1e1163eb07 logged out


============================================================================
============================================================================
                              Finished build.
============================================================================
============================================================================


Build step 'Execute shell' marked build as failure
Archiving artifacts
Sending artifact delta relative to PreCommit-YARN-Build #8218
Archived 87 artifacts
Archive block size is 32768
Received 72 blocks and 14784713 bytes
Compression is 13.8%
Took 5.9 sec
[description-setter] Could not determine description.
Recording test results
Email was triggered for: Failure
Sending email for trigger: Failure



###################################################################################
############################## FAILED TESTS (if any) ##############################
2 tests failed.
FAILED:  org.apache.hadoop.yarn.server.resourcemanager.scheduler.fair.TestFairScheduler.testContinuousScheduling

Error Message:
expected:<2> but was:<1>

Stack Trace:
java.lang.AssertionError: expected:<2> but was:<1>
	at org.junit.Assert.fail(Assert.java:88)
	at org.junit.Assert.failNotEquals(Assert.java:743)
	at org.junit.Assert.assertEquals(Assert.java:118)
	at org.junit.Assert.assertEquals(Assert.java:555)
	at org.junit.Assert.assertEquals(Assert.java:542)
	at org.apache.hadoop.yarn.server.resourcemanager.scheduler.fair.TestFairScheduler.testContinuousScheduling(TestFairScheduler.java:4134)


FAILED:  org.apache.hadoop.yarn.server.resourcemanager.security.TestRMDelegationTokens.testRMDTMasterKeyStateOnRollingMasterKey

Error Message:
null

Stack Trace:
java.lang.AssertionError: null
	at org.junit.Assert.fail(Assert.java:86)
	at org.junit.Assert.assertTrue(Assert.java:41)
	at org.junit.Assert.assertTrue(Assert.java:52)
	at org.apache.hadoop.yarn.server.resourcemanager.security.TestRMDelegationTokens$TestRMDelegationTokenSecretManager.checkCurrentKeyInStateStore(TestRMDelegationTokens.java:208)
	at org.apache.hadoop.yarn.server.resourcemanager.security.TestRMDelegationTokens.testRMDTMasterKeyStateOnRollingMasterKey(TestRMDelegationTokens.java:112)



Mime
  • Unnamed multipart/mixed (inline, None, 0 bytes)
View raw message