hadoop-yarn-dev mailing list archives

Site index · List index
Message view « Date » · « Thread »
Top « Date » · « Thread »
From Apache Jenkins Server <jenk...@builds.apache.org>
Subject Failed: YARN-3789 PreCommit Build #8228
Date Tue, 09 Jun 2015 17:39:28 GMT
Jira: https://issues.apache.org/jira/browse/YARN-3789
Build: https://builds.apache.org/job/PreCommit-YARN-Build/8228/

###################################################################################
########################## LAST 60 LINES OF THE CONSOLE ###########################
[...truncated 283 lines...]
|      |                     |            | issues.
|  +1  |         whitespace  |  0m 0s     | The patch has no lines that end in 
|      |                     |            | whitespace.
|  +1  |            install  |  1m 33s    | mvn install still works. 
|  +1  |    eclipse:eclipse  |  0m 33s    | The patch built with 
|      |                     |            | eclipse:eclipse.
|  +1  |           findbugs  |  1m 24s    | The patch does not introduce any 
|      |                     |            | new Findbugs (version 3.0.0)
|      |                     |            | warnings.
|  -1  |         yarn tests  |  50m 58s   | Tests failed in 
|      |                     |            | hadoop-yarn-server-resourcemanager.
|      |                     |  88m 54s   | 


             Reason | Tests
 Failed unit tests  |  hadoop.yarn.server.resourcemanager.TestWorkPreservingRMRestart 


|| Subsystem || Report/Notes ||
============================================================================
| Patch URL | http://issues.apache.org/jira/secure/attachment/12738603/0001-YARN-3789.patch
|
| Optional Tests | javadoc javac unit findbugs checkstyle |
| git revision | trunk / 8d0ef31 |
| hadoop-yarn-server-resourcemanager test log | /home/jenkins/jenkins-slave/workspace/PreCommit-YARN-Build/patchprocess/testrun_hadoop-yarn-server-resourcemanager.txt
|
| Test Results | https://builds.apache.org/job/PreCommit-YARN-Build/8228/testReport/ |
| Java | 1.7.0_55 |
| uname | Linux asf905.gq1.ygridcore.net 3.13.0-36-lowlatency #63-Ubuntu SMP PREEMPT Wed Sep
3 21:56:12 UTC 2014 x86_64 x86_64 x86_64 GNU/Linux |


============================================================================
============================================================================
                          Adding comment to JIRA
============================================================================
============================================================================


Comment added.
4742b942f984605a6defb5d2fa4b52c94e6deed4 logged out


============================================================================
============================================================================
                              Finished build.
============================================================================
============================================================================


Build step 'Execute shell' marked build as failure
Archiving artifacts
Sending artifact delta relative to PreCommit-YARN-Build #8218
Archived 29 artifacts
Archive block size is 32768
Received 40 blocks and 11508644 bytes
Compression is 10.2%
Took 4.4 sec
[description-setter] Could not determine description.
Recording test results
Email was triggered for: Failure
Sending email for trigger: Failure



###################################################################################
############################## FAILED TESTS (if any) ##############################
1 tests failed.
FAILED:  org.apache.hadoop.yarn.server.resourcemanager.TestWorkPreservingRMRestart.testSchedulerRecovery[1]

Error Message:
expected:<6144> but was:<8192>

Stack Trace:
java.lang.AssertionError: expected:<6144> but was:<8192>
	at org.junit.Assert.fail(Assert.java:88)
	at org.junit.Assert.failNotEquals(Assert.java:743)
	at org.junit.Assert.assertEquals(Assert.java:118)
	at org.junit.Assert.assertEquals(Assert.java:555)
	at org.junit.Assert.assertEquals(Assert.java:542)
	at org.apache.hadoop.yarn.server.resourcemanager.TestWorkPreservingRMRestart.assertMetrics(TestWorkPreservingRMRestart.java:852)
	at org.apache.hadoop.yarn.server.resourcemanager.TestWorkPreservingRMRestart.checkFSQueue(TestWorkPreservingRMRestart.java:341)
	at org.apache.hadoop.yarn.server.resourcemanager.TestWorkPreservingRMRestart.testSchedulerRecovery(TestWorkPreservingRMRestart.java:240)



Mime
  • Unnamed multipart/mixed (inline, None, 0 bytes)
View raw message