hadoop-yarn-dev mailing list archives

Site index · List index
Message view « Date » · « Thread »
Top « Date » · « Thread »
From Apache Jenkins Server <jenk...@builds.apache.org>
Subject Build failed in Jenkins: Hadoop-Yarn-trunk #955
Date Thu, 11 Jun 2015 10:48:57 GMT
See <https://builds.apache.org/job/Hadoop-Yarn-trunk/955/changes>

Changes:

[devaraj] MAPREDUCE-6389. Fix BaileyBorweinPlouffe CLI usage message. Contributed by

[wang] HDFS-8549. Abort the balancer if an upgrade is in progress.

[xgong] YARN-3785. Support for Resource as an argument during submitApp call in

[vinayakumarb] HADOOP-12074. in Shell.java#runCommand() rethrow InterruptedException as InterruptedIOException
(Contributed by Lavkesh Lahngir)

------------------------------------------
[...truncated 8395 lines...]
java.lang.UnsupportedOperationException: null
	at org.apache.hadoop.fs.permission.FsPermission$ImmutableFsPermission.applyUMask(FsPermission.java:380)
	at org.apache.hadoop.fs.RawLocalFileSystem.mkOneDirWithMode(RawLocalFileSystem.java:498)
	at org.apache.hadoop.fs.RawLocalFileSystem.mkdirsWithOptionalPermission(RawLocalFileSystem.java:553)
	at org.apache.hadoop.fs.RawLocalFileSystem.mkdirs(RawLocalFileSystem.java:531)
	at org.apache.hadoop.fs.FilterFileSystem.mkdirs(FilterFileSystem.java:314)
	at org.apache.hadoop.yarn.server.timeline.RollingLevelDB.initFileSystem(RollingLevelDB.java:207)
	at org.apache.hadoop.yarn.server.timeline.RollingLevelDB.init(RollingLevelDB.java:200)
	at org.apache.hadoop.yarn.server.timeline.RollingLevelDBTimelineStore.serviceInit(RollingLevelDBTimelineStore.java:321)
	at org.apache.hadoop.service.AbstractService.init(AbstractService.java:163)
	at org.apache.hadoop.yarn.server.timeline.TestRollingLevelDBTimelineStore.setup(TestRollingLevelDBTimelineStore.java:65)

testRelatingToOldEntityWithoutDomainId(org.apache.hadoop.yarn.server.timeline.TestRollingLevelDBTimelineStore)
 Time elapsed: 0.054 sec  <<< ERROR!
java.lang.UnsupportedOperationException: null
	at org.apache.hadoop.fs.permission.FsPermission$ImmutableFsPermission.applyUMask(FsPermission.java:380)
	at org.apache.hadoop.fs.RawLocalFileSystem.mkOneDirWithMode(RawLocalFileSystem.java:498)
	at org.apache.hadoop.fs.RawLocalFileSystem.mkdirsWithOptionalPermission(RawLocalFileSystem.java:553)
	at org.apache.hadoop.fs.RawLocalFileSystem.mkdirs(RawLocalFileSystem.java:531)
	at org.apache.hadoop.fs.FilterFileSystem.mkdirs(FilterFileSystem.java:314)
	at org.apache.hadoop.yarn.server.timeline.RollingLevelDB.initFileSystem(RollingLevelDB.java:207)
	at org.apache.hadoop.yarn.server.timeline.RollingLevelDB.init(RollingLevelDB.java:200)
	at org.apache.hadoop.yarn.server.timeline.RollingLevelDBTimelineStore.serviceInit(RollingLevelDBTimelineStore.java:321)
	at org.apache.hadoop.service.AbstractService.init(AbstractService.java:163)
	at org.apache.hadoop.yarn.server.timeline.TestRollingLevelDBTimelineStore.setup(TestRollingLevelDBTimelineStore.java:65)

testRootDirPermission(org.apache.hadoop.yarn.server.timeline.TestRollingLevelDBTimelineStore)
 Time elapsed: 0.048 sec  <<< ERROR!
java.lang.UnsupportedOperationException: null
	at org.apache.hadoop.fs.permission.FsPermission$ImmutableFsPermission.applyUMask(FsPermission.java:380)
	at org.apache.hadoop.fs.RawLocalFileSystem.mkOneDirWithMode(RawLocalFileSystem.java:498)
	at org.apache.hadoop.fs.RawLocalFileSystem.mkdirsWithOptionalPermission(RawLocalFileSystem.java:553)
	at org.apache.hadoop.fs.RawLocalFileSystem.mkdirs(RawLocalFileSystem.java:531)
	at org.apache.hadoop.fs.FilterFileSystem.mkdirs(FilterFileSystem.java:314)
	at org.apache.hadoop.yarn.server.timeline.RollingLevelDB.initFileSystem(RollingLevelDB.java:207)
	at org.apache.hadoop.yarn.server.timeline.RollingLevelDB.init(RollingLevelDB.java:200)
	at org.apache.hadoop.yarn.server.timeline.RollingLevelDBTimelineStore.serviceInit(RollingLevelDBTimelineStore.java:321)
	at org.apache.hadoop.service.AbstractService.init(AbstractService.java:163)
	at org.apache.hadoop.yarn.server.timeline.TestRollingLevelDBTimelineStore.setup(TestRollingLevelDBTimelineStore.java:65)

testGetSingleEntity(org.apache.hadoop.yarn.server.timeline.TestRollingLevelDBTimelineStore)
 Time elapsed: 0.049 sec  <<< ERROR!
java.lang.UnsupportedOperationException: null
	at org.apache.hadoop.fs.permission.FsPermission$ImmutableFsPermission.applyUMask(FsPermission.java:380)
	at org.apache.hadoop.fs.RawLocalFileSystem.mkOneDirWithMode(RawLocalFileSystem.java:498)
	at org.apache.hadoop.fs.RawLocalFileSystem.mkdirsWithOptionalPermission(RawLocalFileSystem.java:553)
	at org.apache.hadoop.fs.RawLocalFileSystem.mkdirs(RawLocalFileSystem.java:531)
	at org.apache.hadoop.fs.FilterFileSystem.mkdirs(FilterFileSystem.java:314)
	at org.apache.hadoop.yarn.server.timeline.RollingLevelDB.initFileSystem(RollingLevelDB.java:207)
	at org.apache.hadoop.yarn.server.timeline.RollingLevelDB.init(RollingLevelDB.java:200)
	at org.apache.hadoop.yarn.server.timeline.RollingLevelDBTimelineStore.serviceInit(RollingLevelDBTimelineStore.java:321)
	at org.apache.hadoop.service.AbstractService.init(AbstractService.java:163)
	at org.apache.hadoop.yarn.server.timeline.TestRollingLevelDBTimelineStore.setup(TestRollingLevelDBTimelineStore.java:65)

testCacheSizes(org.apache.hadoop.yarn.server.timeline.TestRollingLevelDBTimelineStore)  Time
elapsed: 0.05 sec  <<< ERROR!
java.lang.UnsupportedOperationException: null
	at org.apache.hadoop.fs.permission.FsPermission$ImmutableFsPermission.applyUMask(FsPermission.java:380)
	at org.apache.hadoop.fs.RawLocalFileSystem.mkOneDirWithMode(RawLocalFileSystem.java:498)
	at org.apache.hadoop.fs.RawLocalFileSystem.mkdirsWithOptionalPermission(RawLocalFileSystem.java:553)
	at org.apache.hadoop.fs.RawLocalFileSystem.mkdirs(RawLocalFileSystem.java:531)
	at org.apache.hadoop.fs.FilterFileSystem.mkdirs(FilterFileSystem.java:314)
	at org.apache.hadoop.yarn.server.timeline.RollingLevelDB.initFileSystem(RollingLevelDB.java:207)
	at org.apache.hadoop.yarn.server.timeline.RollingLevelDB.init(RollingLevelDB.java:200)
	at org.apache.hadoop.yarn.server.timeline.RollingLevelDBTimelineStore.serviceInit(RollingLevelDBTimelineStore.java:321)
	at org.apache.hadoop.service.AbstractService.init(AbstractService.java:163)
	at org.apache.hadoop.yarn.server.timeline.TestRollingLevelDBTimelineStore.setup(TestRollingLevelDBTimelineStore.java:65)

testGetEntities(org.apache.hadoop.yarn.server.timeline.TestRollingLevelDBTimelineStore)  Time
elapsed: 0.049 sec  <<< ERROR!
java.lang.UnsupportedOperationException: null
	at org.apache.hadoop.fs.permission.FsPermission$ImmutableFsPermission.applyUMask(FsPermission.java:380)
	at org.apache.hadoop.fs.RawLocalFileSystem.mkOneDirWithMode(RawLocalFileSystem.java:498)
	at org.apache.hadoop.fs.RawLocalFileSystem.mkdirsWithOptionalPermission(RawLocalFileSystem.java:553)
	at org.apache.hadoop.fs.RawLocalFileSystem.mkdirs(RawLocalFileSystem.java:531)
	at org.apache.hadoop.fs.FilterFileSystem.mkdirs(FilterFileSystem.java:314)
	at org.apache.hadoop.yarn.server.timeline.RollingLevelDB.initFileSystem(RollingLevelDB.java:207)
	at org.apache.hadoop.yarn.server.timeline.RollingLevelDB.init(RollingLevelDB.java:200)
	at org.apache.hadoop.yarn.server.timeline.RollingLevelDBTimelineStore.serviceInit(RollingLevelDBTimelineStore.java:321)
	at org.apache.hadoop.service.AbstractService.init(AbstractService.java:163)
	at org.apache.hadoop.yarn.server.timeline.TestRollingLevelDBTimelineStore.setup(TestRollingLevelDBTimelineStore.java:65)

testRelatingToEntityInSamePut(org.apache.hadoop.yarn.server.timeline.TestRollingLevelDBTimelineStore)
 Time elapsed: 0.048 sec  <<< ERROR!
java.lang.UnsupportedOperationException: null
	at org.apache.hadoop.fs.permission.FsPermission$ImmutableFsPermission.applyUMask(FsPermission.java:380)
	at org.apache.hadoop.fs.RawLocalFileSystem.mkOneDirWithMode(RawLocalFileSystem.java:498)
	at org.apache.hadoop.fs.RawLocalFileSystem.mkdirsWithOptionalPermission(RawLocalFileSystem.java:553)
	at org.apache.hadoop.fs.RawLocalFileSystem.mkdirs(RawLocalFileSystem.java:531)
	at org.apache.hadoop.fs.FilterFileSystem.mkdirs(FilterFileSystem.java:314)
	at org.apache.hadoop.yarn.server.timeline.RollingLevelDB.initFileSystem(RollingLevelDB.java:207)
	at org.apache.hadoop.yarn.server.timeline.RollingLevelDB.init(RollingLevelDB.java:200)
	at org.apache.hadoop.yarn.server.timeline.RollingLevelDBTimelineStore.serviceInit(RollingLevelDBTimelineStore.java:321)
	at org.apache.hadoop.service.AbstractService.init(AbstractService.java:163)
	at org.apache.hadoop.yarn.server.timeline.TestRollingLevelDBTimelineStore.setup(TestRollingLevelDBTimelineStore.java:65)

testGetDomain(org.apache.hadoop.yarn.server.timeline.TestRollingLevelDBTimelineStore)  Time
elapsed: 0.05 sec  <<< ERROR!
java.lang.UnsupportedOperationException: null
	at org.apache.hadoop.fs.permission.FsPermission$ImmutableFsPermission.applyUMask(FsPermission.java:380)
	at org.apache.hadoop.fs.RawLocalFileSystem.mkOneDirWithMode(RawLocalFileSystem.java:498)
	at org.apache.hadoop.fs.RawLocalFileSystem.mkdirsWithOptionalPermission(RawLocalFileSystem.java:553)
	at org.apache.hadoop.fs.RawLocalFileSystem.mkdirs(RawLocalFileSystem.java:531)
	at org.apache.hadoop.fs.FilterFileSystem.mkdirs(FilterFileSystem.java:314)
	at org.apache.hadoop.yarn.server.timeline.RollingLevelDB.initFileSystem(RollingLevelDB.java:207)
	at org.apache.hadoop.yarn.server.timeline.RollingLevelDB.init(RollingLevelDB.java:200)
	at org.apache.hadoop.yarn.server.timeline.RollingLevelDBTimelineStore.serviceInit(RollingLevelDBTimelineStore.java:321)
	at org.apache.hadoop.service.AbstractService.init(AbstractService.java:163)
	at org.apache.hadoop.yarn.server.timeline.TestRollingLevelDBTimelineStore.setup(TestRollingLevelDBTimelineStore.java:65)

testGetEvents(org.apache.hadoop.yarn.server.timeline.TestRollingLevelDBTimelineStore)  Time
elapsed: 0.048 sec  <<< ERROR!
java.lang.UnsupportedOperationException: null
	at org.apache.hadoop.fs.permission.FsPermission$ImmutableFsPermission.applyUMask(FsPermission.java:380)
	at org.apache.hadoop.fs.RawLocalFileSystem.mkOneDirWithMode(RawLocalFileSystem.java:498)
	at org.apache.hadoop.fs.RawLocalFileSystem.mkdirsWithOptionalPermission(RawLocalFileSystem.java:553)
	at org.apache.hadoop.fs.RawLocalFileSystem.mkdirs(RawLocalFileSystem.java:531)
	at org.apache.hadoop.fs.FilterFileSystem.mkdirs(FilterFileSystem.java:314)
	at org.apache.hadoop.yarn.server.timeline.RollingLevelDB.initFileSystem(RollingLevelDB.java:207)
	at org.apache.hadoop.yarn.server.timeline.RollingLevelDB.init(RollingLevelDB.java:200)
	at org.apache.hadoop.yarn.server.timeline.RollingLevelDBTimelineStore.serviceInit(RollingLevelDBTimelineStore.java:321)
	at org.apache.hadoop.service.AbstractService.init(AbstractService.java:163)
	at org.apache.hadoop.yarn.server.timeline.TestRollingLevelDBTimelineStore.setup(TestRollingLevelDBTimelineStore.java:65)

testGetEntitiesWithSecondaryFilters(org.apache.hadoop.yarn.server.timeline.TestRollingLevelDBTimelineStore)
 Time elapsed: 0.046 sec  <<< ERROR!
java.lang.UnsupportedOperationException: null
	at org.apache.hadoop.fs.permission.FsPermission$ImmutableFsPermission.applyUMask(FsPermission.java:380)
	at org.apache.hadoop.fs.RawLocalFileSystem.mkOneDirWithMode(RawLocalFileSystem.java:498)
	at org.apache.hadoop.fs.RawLocalFileSystem.mkdirsWithOptionalPermission(RawLocalFileSystem.java:553)
	at org.apache.hadoop.fs.RawLocalFileSystem.mkdirs(RawLocalFileSystem.java:531)
	at org.apache.hadoop.fs.FilterFileSystem.mkdirs(FilterFileSystem.java:314)
	at org.apache.hadoop.yarn.server.timeline.RollingLevelDB.initFileSystem(RollingLevelDB.java:207)
	at org.apache.hadoop.yarn.server.timeline.RollingLevelDB.init(RollingLevelDB.java:200)
	at org.apache.hadoop.yarn.server.timeline.RollingLevelDBTimelineStore.serviceInit(RollingLevelDBTimelineStore.java:321)
	at org.apache.hadoop.service.AbstractService.init(AbstractService.java:163)
	at org.apache.hadoop.yarn.server.timeline.TestRollingLevelDBTimelineStore.setup(TestRollingLevelDBTimelineStore.java:65)

testCheckVersion(org.apache.hadoop.yarn.server.timeline.TestRollingLevelDBTimelineStore) 
Time elapsed: 0.045 sec  <<< ERROR!
java.lang.UnsupportedOperationException: null
	at org.apache.hadoop.fs.permission.FsPermission$ImmutableFsPermission.applyUMask(FsPermission.java:380)
	at org.apache.hadoop.fs.RawLocalFileSystem.mkOneDirWithMode(RawLocalFileSystem.java:498)
	at org.apache.hadoop.fs.RawLocalFileSystem.mkdirsWithOptionalPermission(RawLocalFileSystem.java:553)
	at org.apache.hadoop.fs.RawLocalFileSystem.mkdirs(RawLocalFileSystem.java:531)
	at org.apache.hadoop.fs.FilterFileSystem.mkdirs(FilterFileSystem.java:314)
	at org.apache.hadoop.yarn.server.timeline.RollingLevelDB.initFileSystem(RollingLevelDB.java:207)
	at org.apache.hadoop.yarn.server.timeline.RollingLevelDB.init(RollingLevelDB.java:200)
	at org.apache.hadoop.yarn.server.timeline.RollingLevelDBTimelineStore.serviceInit(RollingLevelDBTimelineStore.java:321)
	at org.apache.hadoop.service.AbstractService.init(AbstractService.java:163)
	at org.apache.hadoop.yarn.server.timeline.TestRollingLevelDBTimelineStore.setup(TestRollingLevelDBTimelineStore.java:65)

testGetEntitiesWithFromId(org.apache.hadoop.yarn.server.timeline.TestRollingLevelDBTimelineStore)
 Time elapsed: 0.045 sec  <<< ERROR!
java.lang.UnsupportedOperationException: null
	at org.apache.hadoop.fs.permission.FsPermission$ImmutableFsPermission.applyUMask(FsPermission.java:380)
	at org.apache.hadoop.fs.RawLocalFileSystem.mkOneDirWithMode(RawLocalFileSystem.java:498)
	at org.apache.hadoop.fs.RawLocalFileSystem.mkdirsWithOptionalPermission(RawLocalFileSystem.java:553)
	at org.apache.hadoop.fs.RawLocalFileSystem.mkdirs(RawLocalFileSystem.java:531)
	at org.apache.hadoop.fs.FilterFileSystem.mkdirs(FilterFileSystem.java:314)
	at org.apache.hadoop.yarn.server.timeline.RollingLevelDB.initFileSystem(RollingLevelDB.java:207)
	at org.apache.hadoop.yarn.server.timeline.RollingLevelDB.init(RollingLevelDB.java:200)
	at org.apache.hadoop.yarn.server.timeline.RollingLevelDBTimelineStore.serviceInit(RollingLevelDBTimelineStore.java:321)
	at org.apache.hadoop.service.AbstractService.init(AbstractService.java:163)
	at org.apache.hadoop.yarn.server.timeline.TestRollingLevelDBTimelineStore.setup(TestRollingLevelDBTimelineStore.java:65)

testGetEntitiesWithFromTs(org.apache.hadoop.yarn.server.timeline.TestRollingLevelDBTimelineStore)
 Time elapsed: 0.043 sec  <<< ERROR!
java.lang.UnsupportedOperationException: null
	at org.apache.hadoop.fs.permission.FsPermission$ImmutableFsPermission.applyUMask(FsPermission.java:380)
	at org.apache.hadoop.fs.RawLocalFileSystem.mkOneDirWithMode(RawLocalFileSystem.java:498)
	at org.apache.hadoop.fs.RawLocalFileSystem.mkdirsWithOptionalPermission(RawLocalFileSystem.java:553)
	at org.apache.hadoop.fs.RawLocalFileSystem.mkdirs(RawLocalFileSystem.java:531)
	at org.apache.hadoop.fs.FilterFileSystem.mkdirs(FilterFileSystem.java:314)
	at org.apache.hadoop.yarn.server.timeline.RollingLevelDB.initFileSystem(RollingLevelDB.java:207)
	at org.apache.hadoop.yarn.server.timeline.RollingLevelDB.init(RollingLevelDB.java:200)
	at org.apache.hadoop.yarn.server.timeline.RollingLevelDBTimelineStore.serviceInit(RollingLevelDBTimelineStore.java:321)
	at org.apache.hadoop.service.AbstractService.init(AbstractService.java:163)
	at org.apache.hadoop.yarn.server.timeline.TestRollingLevelDBTimelineStore.setup(TestRollingLevelDBTimelineStore.java:65)

Running org.apache.hadoop.yarn.server.timeline.webapp.TestTimelineWebServices
Tests run: 27, Failures: 0, Errors: 0, Skipped: 0, Time elapsed: 38.374 sec - in org.apache.hadoop.yarn.server.timeline.webapp.TestTimelineWebServices
Running org.apache.hadoop.yarn.server.timeline.webapp.TestTimelineWebServicesWithSSL
Tests run: 1, Failures: 0, Errors: 0, Skipped: 0, Time elapsed: 4.78 sec - in org.apache.hadoop.yarn.server.timeline.webapp.TestTimelineWebServicesWithSSL
Running org.apache.hadoop.yarn.server.timeline.webapp.TestCrossOriginFilter
Tests run: 9, Failures: 0, Errors: 0, Skipped: 0, Time elapsed: 0.45 sec - in org.apache.hadoop.yarn.server.timeline.webapp.TestCrossOriginFilter
Running org.apache.hadoop.yarn.server.timeline.webapp.TestCrossOriginFilterInitializer
Tests run: 1, Failures: 0, Errors: 0, Skipped: 0, Time elapsed: 0.335 sec - in org.apache.hadoop.yarn.server.timeline.webapp.TestCrossOriginFilterInitializer

Results :

Tests in error: 
  TestRollingLevelDB.testInsertForPreviousPeriodAfterRollPeriodRollsDB:90 » UnsupportedOperation
  TestRollingLevelDB.testInsertAfterRollPeriodRollsDB:70 » UnsupportedOperation
  TestRollingLevelDBTimelineStore.setup:65 » UnsupportedOperation
  TestRollingLevelDBTimelineStore.setup:65 » UnsupportedOperation
  TestRollingLevelDBTimelineStore.setup:65 » UnsupportedOperation
  TestRollingLevelDBTimelineStore.setup:65 » UnsupportedOperation
  TestRollingLevelDBTimelineStore.setup:65 » UnsupportedOperation
  TestRollingLevelDBTimelineStore.setup:65 » UnsupportedOperation
  TestRollingLevelDBTimelineStore.setup:65 » UnsupportedOperation
  TestRollingLevelDBTimelineStore.setup:65 » UnsupportedOperation
  TestRollingLevelDBTimelineStore.setup:65 » UnsupportedOperation
  TestRollingLevelDBTimelineStore.setup:65 » UnsupportedOperation
  TestRollingLevelDBTimelineStore.setup:65 » UnsupportedOperation
  TestRollingLevelDBTimelineStore.setup:65 » UnsupportedOperation
  TestRollingLevelDBTimelineStore.setup:65 » UnsupportedOperation
  TestRollingLevelDBTimelineStore.setup:65 » UnsupportedOperation
  TestRollingLevelDBTimelineStore.setup:65 » UnsupportedOperation
  TestRollingLevelDBTimelineStore.setup:65 » UnsupportedOperation

Tests run: 202, Failures: 0, Errors: 18, Skipped: 0

[INFO] ------------------------------------------------------------------------
[INFO] Reactor Summary:
[INFO] 
[INFO] Apache Hadoop YARN ................................ SUCCESS [  3.246 s]
[INFO] Apache Hadoop YARN API ............................ SUCCESS [03:34 min]
[INFO] Apache Hadoop YARN Common ......................... SUCCESS [02:54 min]
[INFO] Apache Hadoop YARN Server ......................... SUCCESS [  0.093 s]
[INFO] Apache Hadoop YARN Server Common .................. SUCCESS [ 45.149 s]
[INFO] Apache Hadoop YARN NodeManager .................... SUCCESS [06:33 min]
[INFO] Apache Hadoop YARN Web Proxy ...................... SUCCESS [ 23.588 s]
[INFO] Apache Hadoop YARN ApplicationHistoryService ...... FAILURE [02:30 min]
[INFO] Apache Hadoop YARN ResourceManager ................ SKIPPED
[INFO] Apache Hadoop YARN Server Tests ................... SKIPPED
[INFO] Apache Hadoop YARN Client ......................... SKIPPED
[INFO] Apache Hadoop YARN SharedCacheManager ............. SKIPPED
[INFO] Apache Hadoop YARN Applications ................... SKIPPED
[INFO] Apache Hadoop YARN DistributedShell ............... SKIPPED
[INFO] Apache Hadoop YARN Unmanaged Am Launcher .......... SKIPPED
[INFO] Apache Hadoop YARN Site ........................... SKIPPED
[INFO] Apache Hadoop YARN Registry ....................... SKIPPED
[INFO] Apache Hadoop YARN Project ........................ SKIPPED
[INFO] ------------------------------------------------------------------------
[INFO] BUILD FAILURE
[INFO] ------------------------------------------------------------------------
[INFO] Total time: 16:46 min
[INFO] Finished at: 2015-06-11T10:48:48+00:00
[INFO] Final Memory: 82M/1100M
[INFO] ------------------------------------------------------------------------
[ERROR] Failed to execute goal org.apache.maven.plugins:maven-surefire-plugin:2.17:test (default-test)
on project hadoop-yarn-server-applicationhistoryservice: There are test failures.
[ERROR] 
[ERROR] Please refer to <https://builds.apache.org/job/Hadoop-Yarn-trunk/ws/hadoop-yarn-project/hadoop-yarn/hadoop-yarn-server/hadoop-yarn-server-applicationhistoryservice/target/surefire-reports>
for the individual test results.
[ERROR] -> [Help 1]
[ERROR] 
[ERROR] To see the full stack trace of the errors, re-run Maven with the -e switch.
[ERROR] Re-run Maven using the -X switch to enable full debug logging.
[ERROR] 
[ERROR] For more information about the errors and possible solutions, please read the following
articles:
[ERROR] [Help 1] http://cwiki.apache.org/confluence/display/MAVEN/MojoFailureException
[ERROR] 
[ERROR] After correcting the problems, you can resume the build with the command
[ERROR]   mvn <goals> -rf :hadoop-yarn-server-applicationhistoryservice
Build step 'Execute shell' marked build as failure
Archiving artifacts
Recording test results
Updating HADOOP-12074
Updating YARN-3785
Updating HDFS-8549
Updating MAPREDUCE-6389

Mime
View raw message