hadoop-yarn-dev mailing list archives

Site index · List index
Message view « Date » · « Thread »
Top « Date » · « Thread »
From Apache Jenkins Server <jenk...@builds.apache.org>
Subject Failed: YARN-3804 PreCommit Build #8260
Date Tue, 16 Jun 2015 13:30:22 GMT
Jira: https://issues.apache.org/jira/browse/YARN-3804
Build: https://builds.apache.org/job/PreCommit-YARN-Build/8260/

###################################################################################
########################## LAST 60 LINES OF THE CONSOLE ###########################
[...truncated 282 lines...]
|  +1  |         whitespace  |  0m 0s     | The patch has no lines that end in 
|      |                     |            | whitespace.
|  +1  |            install  |  1m 34s    | mvn install still works. 
|  +1  |    eclipse:eclipse  |  0m 33s    | The patch built with 
|      |                     |            | eclipse:eclipse.
|  +1  |           findbugs  |  1m 34s    | The patch does not introduce any 
|      |                     |            | new Findbugs (version 3.0.0)
|      |                     |            | warnings.
|  -1  |         yarn tests  |  1m 58s    | Tests failed in hadoop-yarn-common. 
|      |                     |  41m 38s   | 


             Reason | Tests
 Failed unit tests  |  hadoop.yarn.security.TestYARNTokenIdentifier 


|| Subsystem || Report/Notes ||
============================================================================
| Patch URL | http://issues.apache.org/jira/secure/attachment/12739849/YARN-3804.01.patch
|
| Optional Tests | javadoc javac unit findbugs checkstyle |
| git revision | trunk / b039e69 |
| checkstyle |  /home/jenkins/jenkins-slave/workspace/PreCommit-YARN-Build/patchprocess/diffcheckstylehadoop-yarn-common.txt
|
| hadoop-yarn-common test log | /home/jenkins/jenkins-slave/workspace/PreCommit-YARN-Build/patchprocess/testrun_hadoop-yarn-common.txt
|
| Test Results | https://builds.apache.org/job/PreCommit-YARN-Build/8260/testReport/ |
| Java | 1.7.0_55 |
| uname | Linux asf904.gq1.ygridcore.net 3.13.0-36-lowlatency #63-Ubuntu SMP PREEMPT Wed Sep
3 21:56:12 UTC 2014 x86_64 x86_64 x86_64 GNU/Linux |


============================================================================
============================================================================
                          Adding comment to JIRA
============================================================================
============================================================================


Comment added.
abcee214b2af5d1b0032f04953bf962bd98c4f6c logged out


============================================================================
============================================================================
                              Finished build.
============================================================================
============================================================================


Build step 'Execute shell' marked build as failure
Archiving artifacts
Sending artifact delta relative to PreCommit-YARN-Build #8254
Archived 30 artifacts
Archive block size is 32768
Received 65 blocks and 9515039 bytes
Compression is 18.3%
Took 4.5 sec
[description-setter] Could not determine description.
Recording test results
Publish JUnit test result report is waiting for a checkpoint on PreCommit-YARN-Build #8259
Email was triggered for: Failure
Sending email for trigger: Failure



###################################################################################
############################## FAILED TESTS (if any) ##############################
7 tests failed.
FAILED:  org.apache.hadoop.yarn.security.TestYARNTokenIdentifier.testAMRMTokenIdentifier

Error Message:
org/apache/hadoop/util/StringInterner

Stack Trace:
java.lang.NoClassDefFoundError: org/apache/hadoop/util/StringInterner
	at java.net.URLClassLoader$1.run(URLClassLoader.java:366)
	at java.net.URLClassLoader$1.run(URLClassLoader.java:355)
	at java.security.AccessController.doPrivileged(Native Method)
	at java.net.URLClassLoader.findClass(URLClassLoader.java:354)
	at java.lang.ClassLoader.loadClass(ClassLoader.java:425)
	at sun.misc.Launcher$AppClassLoader.loadClass(Launcher.java:308)
	at java.lang.ClassLoader.loadClass(ClassLoader.java:358)
	at org.apache.hadoop.conf.Configuration.loadResource(Configuration.java:2681)
	at org.apache.hadoop.conf.Configuration.loadResources(Configuration.java:2558)
	at org.apache.hadoop.conf.Configuration.getProps(Configuration.java:2469)
	at org.apache.hadoop.conf.Configuration.get(Configuration.java:1294)
	at org.apache.hadoop.yarn.factory.providers.RecordFactoryProvider.getRecordFactory(RecordFactoryProvider.java:49)
	at org.apache.hadoop.yarn.util.Records.<clinit>(Records.java:32)
	at org.apache.hadoop.yarn.api.records.ApplicationId.newInstance(ApplicationId.java:49)
	at org.apache.hadoop.yarn.security.TestYARNTokenIdentifier.testAMRMTokenIdentifier(TestYARNTokenIdentifier.java:87)


FAILED:  org.apache.hadoop.yarn.security.TestYARNTokenIdentifier.testRMDelegationTokenIdentifier

Error Message:
org/apache/hadoop/io/Text

Stack Trace:
java.lang.NoClassDefFoundError: org/apache/hadoop/io/Text
	at java.net.URLClassLoader$1.run(URLClassLoader.java:366)
	at java.net.URLClassLoader$1.run(URLClassLoader.java:355)
	at java.security.AccessController.doPrivileged(Native Method)
	at java.net.URLClassLoader.findClass(URLClassLoader.java:354)
	at java.lang.ClassLoader.loadClass(ClassLoader.java:425)
	at sun.misc.Launcher$AppClassLoader.loadClass(Launcher.java:308)
	at java.lang.ClassLoader.loadClass(ClassLoader.java:358)
	at org.apache.hadoop.yarn.security.TestYARNTokenIdentifier.testRMDelegationTokenIdentifier(TestYARNTokenIdentifier.java:209)


FAILED:  org.apache.hadoop.yarn.security.TestYARNTokenIdentifier.testContainerTokenIdentifier

Error Message:
Could not initialize class org.apache.hadoop.yarn.util.Records

Stack Trace:
java.lang.NoClassDefFoundError: Could not initialize class org.apache.hadoop.yarn.util.Records
	at org.apache.hadoop.yarn.api.records.ApplicationId.newInstance(ApplicationId.java:49)
	at org.apache.hadoop.yarn.security.TestYARNTokenIdentifier.testContainerTokenIdentifier(TestYARNTokenIdentifier.java:140)


FAILED:  org.apache.hadoop.yarn.security.TestYARNTokenIdentifier.testNMTokenIdentifier

Error Message:
Could not initialize class org.apache.hadoop.yarn.util.Records

Stack Trace:
java.lang.NoClassDefFoundError: Could not initialize class org.apache.hadoop.yarn.util.Records
	at org.apache.hadoop.yarn.api.records.ApplicationId.newInstance(ApplicationId.java:49)
	at org.apache.hadoop.yarn.security.TestYARNTokenIdentifier.testNMTokenIdentifier(TestYARNTokenIdentifier.java:47)


FAILED:  org.apache.hadoop.yarn.security.TestYARNTokenIdentifier.testTimelineDelegationTokenIdentifier

Error Message:
org/apache/hadoop/io/Text

Stack Trace:
java.lang.NoClassDefFoundError: org/apache/hadoop/io/Text
	at org.apache.hadoop.yarn.security.TestYARNTokenIdentifier.testTimelineDelegationTokenIdentifier(TestYARNTokenIdentifier.java:286)


FAILED:  org.apache.hadoop.yarn.security.TestYARNTokenIdentifier.testClientToAMTokenIdentifier

Error Message:
Could not initialize class org.apache.hadoop.yarn.util.Records

Stack Trace:
java.lang.NoClassDefFoundError: Could not initialize class org.apache.hadoop.yarn.util.Records
	at org.apache.hadoop.yarn.api.records.ApplicationId.newInstance(ApplicationId.java:49)
	at org.apache.hadoop.yarn.security.TestYARNTokenIdentifier.testClientToAMTokenIdentifier(TestYARNTokenIdentifier.java:112)


FAILED:  org.apache.hadoop.yarn.security.TestYARNTokenIdentifier.testParseTimelineDelegationTokenIdentifierRenewer

Error Message:
org/apache/hadoop/HadoopIllegalArgumentException

Stack Trace:
java.lang.NoClassDefFoundError: org/apache/hadoop/HadoopIllegalArgumentException
	at java.net.URLClassLoader$1.run(URLClassLoader.java:366)
	at java.net.URLClassLoader$1.run(URLClassLoader.java:355)
	at java.security.AccessController.doPrivileged(Native Method)
	at java.net.URLClassLoader.findClass(URLClassLoader.java:354)
	at java.lang.ClassLoader.loadClass(ClassLoader.java:425)
	at sun.misc.Launcher$AppClassLoader.loadClass(Launcher.java:308)
	at java.lang.ClassLoader.loadClass(ClassLoader.java:358)
	at org.apache.hadoop.yarn.security.TestYARNTokenIdentifier.testParseTimelineDelegationTokenIdentifierRenewer(TestYARNTokenIdentifier.java:338)



Mime
  • Unnamed multipart/mixed (inline, None, 0 bytes)
View raw message