hadoop-yarn-dev mailing list archives

Site index · List index
Message view « Date » · « Thread »
Top « Date » · « Thread »
From Apache Jenkins Server <jenk...@builds.apache.org>
Subject Build failed in Jenkins: Hadoop-Yarn-trunk-Java8 #232
Date Thu, 18 Jun 2015 14:35:38 GMT
See <https://builds.apache.org/job/Hadoop-Yarn-trunk-Java8/232/changes>

Changes:

[wang] HDFS-8608. Merge HDFS-7912 to trunk and branch-2 (track BlockInfo instead of Block
in UnderReplicatedBlocks and PendingReplicationBlocks). Contributed by Zhe Zhang.

[wheat9] HDFS-8238. Move ClientProtocol to the hdfs-client. Contributed by Takanobu Asanuma.

[wheat9] Update CHANGES.txt for HDFS-8238.

[xgong] YARN-3804. Both RM are on standBy state when kerberos user not in yarn.admin.acl.
Contributed by Varun Saxena

[wheat9] HDFS-8446. Separate safemode related operations in GetBlockLocations(). Contributed
by Haohui Mai.

[cmccabe] HDFS-8589. Fix unused imports in BPServiceActor and BlockReportLeaseManager (cmccabe)

[aajisaka] HDFS-8615. Correct HTTP method in WebHDFS document. Contributed by Brahma Reddy
Battula.

[aajisaka] HDFS-6249. Output AclEntry in PBImageXmlWriter. Contributed by surendra singh lilhore.

[yzhang] HADOOP-11965. determine-flaky-tests needs a summary mode. Contributed by Yufei Gu,

[devaraj] MAPREDUCE-6373. The logger reports total input paths but it is referring

[vinayakumarb] HADOOP-7139. Allow appending to existing SequenceFiles (Contributed by kanaka
kumar avvaru)

[devaraj] YARN-3824. Fix two minor nits in member variable properties of

------------------------------------------
[...truncated 4678 lines...]
	at org.apache.hadoop.fs.RawLocalFileSystem.mkdirsWithOptionalPermission(RawLocalFileSystem.java:554)
	at org.apache.hadoop.fs.RawLocalFileSystem.mkdirs(RawLocalFileSystem.java:531)
	at org.apache.hadoop.fs.FilterFileSystem.mkdirs(FilterFileSystem.java:314)
	at org.apache.hadoop.yarn.server.timeline.RollingLevelDB.initFileSystem(RollingLevelDB.java:207)
	at org.apache.hadoop.yarn.server.timeline.RollingLevelDB.init(RollingLevelDB.java:200)
	at org.apache.hadoop.yarn.server.timeline.RollingLevelDBTimelineStore.serviceInit(RollingLevelDBTimelineStore.java:321)
	at org.apache.hadoop.service.AbstractService.init(AbstractService.java:163)
	at org.apache.hadoop.yarn.server.timeline.TestRollingLevelDBTimelineStore.setup(TestRollingLevelDBTimelineStore.java:65)

testCacheSizes(org.apache.hadoop.yarn.server.timeline.TestRollingLevelDBTimelineStore)  Time
elapsed: 0.041 sec  <<< ERROR!
java.lang.UnsupportedOperationException: null
	at org.apache.hadoop.fs.permission.FsPermission$ImmutableFsPermission.applyUMask(FsPermission.java:380)
	at org.apache.hadoop.fs.RawLocalFileSystem.mkOneDirWithMode(RawLocalFileSystem.java:498)
	at org.apache.hadoop.fs.RawLocalFileSystem.mkdirsWithOptionalPermission(RawLocalFileSystem.java:554)
	at org.apache.hadoop.fs.RawLocalFileSystem.mkdirs(RawLocalFileSystem.java:531)
	at org.apache.hadoop.fs.FilterFileSystem.mkdirs(FilterFileSystem.java:314)
	at org.apache.hadoop.yarn.server.timeline.RollingLevelDB.initFileSystem(RollingLevelDB.java:207)
	at org.apache.hadoop.yarn.server.timeline.RollingLevelDB.init(RollingLevelDB.java:200)
	at org.apache.hadoop.yarn.server.timeline.RollingLevelDBTimelineStore.serviceInit(RollingLevelDBTimelineStore.java:321)
	at org.apache.hadoop.service.AbstractService.init(AbstractService.java:163)
	at org.apache.hadoop.yarn.server.timeline.TestRollingLevelDBTimelineStore.setup(TestRollingLevelDBTimelineStore.java:65)

testGetEntities(org.apache.hadoop.yarn.server.timeline.TestRollingLevelDBTimelineStore)  Time
elapsed: 0.053 sec  <<< ERROR!
java.lang.UnsupportedOperationException: null
	at org.apache.hadoop.fs.permission.FsPermission$ImmutableFsPermission.applyUMask(FsPermission.java:380)
	at org.apache.hadoop.fs.RawLocalFileSystem.mkOneDirWithMode(RawLocalFileSystem.java:498)
	at org.apache.hadoop.fs.RawLocalFileSystem.mkdirsWithOptionalPermission(RawLocalFileSystem.java:554)
	at org.apache.hadoop.fs.RawLocalFileSystem.mkdirs(RawLocalFileSystem.java:531)
	at org.apache.hadoop.fs.FilterFileSystem.mkdirs(FilterFileSystem.java:314)
	at org.apache.hadoop.yarn.server.timeline.RollingLevelDB.initFileSystem(RollingLevelDB.java:207)
	at org.apache.hadoop.yarn.server.timeline.RollingLevelDB.init(RollingLevelDB.java:200)
	at org.apache.hadoop.yarn.server.timeline.RollingLevelDBTimelineStore.serviceInit(RollingLevelDBTimelineStore.java:321)
	at org.apache.hadoop.service.AbstractService.init(AbstractService.java:163)
	at org.apache.hadoop.yarn.server.timeline.TestRollingLevelDBTimelineStore.setup(TestRollingLevelDBTimelineStore.java:65)

testRelatingToEntityInSamePut(org.apache.hadoop.yarn.server.timeline.TestRollingLevelDBTimelineStore)
 Time elapsed: 0.04 sec  <<< ERROR!
java.lang.UnsupportedOperationException: null
	at org.apache.hadoop.fs.permission.FsPermission$ImmutableFsPermission.applyUMask(FsPermission.java:380)
	at org.apache.hadoop.fs.RawLocalFileSystem.mkOneDirWithMode(RawLocalFileSystem.java:498)
	at org.apache.hadoop.fs.RawLocalFileSystem.mkdirsWithOptionalPermission(RawLocalFileSystem.java:554)
	at org.apache.hadoop.fs.RawLocalFileSystem.mkdirs(RawLocalFileSystem.java:531)
	at org.apache.hadoop.fs.FilterFileSystem.mkdirs(FilterFileSystem.java:314)
	at org.apache.hadoop.yarn.server.timeline.RollingLevelDB.initFileSystem(RollingLevelDB.java:207)
	at org.apache.hadoop.yarn.server.timeline.RollingLevelDB.init(RollingLevelDB.java:200)
	at org.apache.hadoop.yarn.server.timeline.RollingLevelDBTimelineStore.serviceInit(RollingLevelDBTimelineStore.java:321)
	at org.apache.hadoop.service.AbstractService.init(AbstractService.java:163)
	at org.apache.hadoop.yarn.server.timeline.TestRollingLevelDBTimelineStore.setup(TestRollingLevelDBTimelineStore.java:65)

testGetDomain(org.apache.hadoop.yarn.server.timeline.TestRollingLevelDBTimelineStore)  Time
elapsed: 0.039 sec  <<< ERROR!
java.lang.UnsupportedOperationException: null
	at org.apache.hadoop.fs.permission.FsPermission$ImmutableFsPermission.applyUMask(FsPermission.java:380)
	at org.apache.hadoop.fs.RawLocalFileSystem.mkOneDirWithMode(RawLocalFileSystem.java:498)
	at org.apache.hadoop.fs.RawLocalFileSystem.mkdirsWithOptionalPermission(RawLocalFileSystem.java:554)
	at org.apache.hadoop.fs.RawLocalFileSystem.mkdirs(RawLocalFileSystem.java:531)
	at org.apache.hadoop.fs.FilterFileSystem.mkdirs(FilterFileSystem.java:314)
	at org.apache.hadoop.yarn.server.timeline.RollingLevelDB.initFileSystem(RollingLevelDB.java:207)
	at org.apache.hadoop.yarn.server.timeline.RollingLevelDB.init(RollingLevelDB.java:200)
	at org.apache.hadoop.yarn.server.timeline.RollingLevelDBTimelineStore.serviceInit(RollingLevelDBTimelineStore.java:321)
	at org.apache.hadoop.service.AbstractService.init(AbstractService.java:163)
	at org.apache.hadoop.yarn.server.timeline.TestRollingLevelDBTimelineStore.setup(TestRollingLevelDBTimelineStore.java:65)

testGetEvents(org.apache.hadoop.yarn.server.timeline.TestRollingLevelDBTimelineStore)  Time
elapsed: 0.037 sec  <<< ERROR!
java.lang.UnsupportedOperationException: null
	at org.apache.hadoop.fs.permission.FsPermission$ImmutableFsPermission.applyUMask(FsPermission.java:380)
	at org.apache.hadoop.fs.RawLocalFileSystem.mkOneDirWithMode(RawLocalFileSystem.java:498)
	at org.apache.hadoop.fs.RawLocalFileSystem.mkdirsWithOptionalPermission(RawLocalFileSystem.java:554)
	at org.apache.hadoop.fs.RawLocalFileSystem.mkdirs(RawLocalFileSystem.java:531)
	at org.apache.hadoop.fs.FilterFileSystem.mkdirs(FilterFileSystem.java:314)
	at org.apache.hadoop.yarn.server.timeline.RollingLevelDB.initFileSystem(RollingLevelDB.java:207)
	at org.apache.hadoop.yarn.server.timeline.RollingLevelDB.init(RollingLevelDB.java:200)
	at org.apache.hadoop.yarn.server.timeline.RollingLevelDBTimelineStore.serviceInit(RollingLevelDBTimelineStore.java:321)
	at org.apache.hadoop.service.AbstractService.init(AbstractService.java:163)
	at org.apache.hadoop.yarn.server.timeline.TestRollingLevelDBTimelineStore.setup(TestRollingLevelDBTimelineStore.java:65)

testGetEntitiesWithSecondaryFilters(org.apache.hadoop.yarn.server.timeline.TestRollingLevelDBTimelineStore)
 Time elapsed: 0.036 sec  <<< ERROR!
java.lang.UnsupportedOperationException: null
	at org.apache.hadoop.fs.permission.FsPermission$ImmutableFsPermission.applyUMask(FsPermission.java:380)
	at org.apache.hadoop.fs.RawLocalFileSystem.mkOneDirWithMode(RawLocalFileSystem.java:498)
	at org.apache.hadoop.fs.RawLocalFileSystem.mkdirsWithOptionalPermission(RawLocalFileSystem.java:554)
	at org.apache.hadoop.fs.RawLocalFileSystem.mkdirs(RawLocalFileSystem.java:531)
	at org.apache.hadoop.fs.FilterFileSystem.mkdirs(FilterFileSystem.java:314)
	at org.apache.hadoop.yarn.server.timeline.RollingLevelDB.initFileSystem(RollingLevelDB.java:207)
	at org.apache.hadoop.yarn.server.timeline.RollingLevelDB.init(RollingLevelDB.java:200)
	at org.apache.hadoop.yarn.server.timeline.RollingLevelDBTimelineStore.serviceInit(RollingLevelDBTimelineStore.java:321)
	at org.apache.hadoop.service.AbstractService.init(AbstractService.java:163)
	at org.apache.hadoop.yarn.server.timeline.TestRollingLevelDBTimelineStore.setup(TestRollingLevelDBTimelineStore.java:65)

testCheckVersion(org.apache.hadoop.yarn.server.timeline.TestRollingLevelDBTimelineStore) 
Time elapsed: 0.039 sec  <<< ERROR!
java.lang.UnsupportedOperationException: null
	at org.apache.hadoop.fs.permission.FsPermission$ImmutableFsPermission.applyUMask(FsPermission.java:380)
	at org.apache.hadoop.fs.RawLocalFileSystem.mkOneDirWithMode(RawLocalFileSystem.java:498)
	at org.apache.hadoop.fs.RawLocalFileSystem.mkdirsWithOptionalPermission(RawLocalFileSystem.java:554)
	at org.apache.hadoop.fs.RawLocalFileSystem.mkdirs(RawLocalFileSystem.java:531)
	at org.apache.hadoop.fs.FilterFileSystem.mkdirs(FilterFileSystem.java:314)
	at org.apache.hadoop.yarn.server.timeline.RollingLevelDB.initFileSystem(RollingLevelDB.java:207)
	at org.apache.hadoop.yarn.server.timeline.RollingLevelDB.init(RollingLevelDB.java:200)
	at org.apache.hadoop.yarn.server.timeline.RollingLevelDBTimelineStore.serviceInit(RollingLevelDBTimelineStore.java:321)
	at org.apache.hadoop.service.AbstractService.init(AbstractService.java:163)
	at org.apache.hadoop.yarn.server.timeline.TestRollingLevelDBTimelineStore.setup(TestRollingLevelDBTimelineStore.java:65)

testGetEntitiesWithFromId(org.apache.hadoop.yarn.server.timeline.TestRollingLevelDBTimelineStore)
 Time elapsed: 0.04 sec  <<< ERROR!
java.lang.UnsupportedOperationException: null
	at org.apache.hadoop.fs.permission.FsPermission$ImmutableFsPermission.applyUMask(FsPermission.java:380)
	at org.apache.hadoop.fs.RawLocalFileSystem.mkOneDirWithMode(RawLocalFileSystem.java:498)
	at org.apache.hadoop.fs.RawLocalFileSystem.mkdirsWithOptionalPermission(RawLocalFileSystem.java:554)
	at org.apache.hadoop.fs.RawLocalFileSystem.mkdirs(RawLocalFileSystem.java:531)
	at org.apache.hadoop.fs.FilterFileSystem.mkdirs(FilterFileSystem.java:314)
	at org.apache.hadoop.yarn.server.timeline.RollingLevelDB.initFileSystem(RollingLevelDB.java:207)
	at org.apache.hadoop.yarn.server.timeline.RollingLevelDB.init(RollingLevelDB.java:200)
	at org.apache.hadoop.yarn.server.timeline.RollingLevelDBTimelineStore.serviceInit(RollingLevelDBTimelineStore.java:321)
	at org.apache.hadoop.service.AbstractService.init(AbstractService.java:163)
	at org.apache.hadoop.yarn.server.timeline.TestRollingLevelDBTimelineStore.setup(TestRollingLevelDBTimelineStore.java:65)

testGetEntitiesWithFromTs(org.apache.hadoop.yarn.server.timeline.TestRollingLevelDBTimelineStore)
 Time elapsed: 0.043 sec  <<< ERROR!
java.lang.UnsupportedOperationException: null
	at org.apache.hadoop.fs.permission.FsPermission$ImmutableFsPermission.applyUMask(FsPermission.java:380)
	at org.apache.hadoop.fs.RawLocalFileSystem.mkOneDirWithMode(RawLocalFileSystem.java:498)
	at org.apache.hadoop.fs.RawLocalFileSystem.mkdirsWithOptionalPermission(RawLocalFileSystem.java:554)
	at org.apache.hadoop.fs.RawLocalFileSystem.mkdirs(RawLocalFileSystem.java:531)
	at org.apache.hadoop.fs.FilterFileSystem.mkdirs(FilterFileSystem.java:314)
	at org.apache.hadoop.yarn.server.timeline.RollingLevelDB.initFileSystem(RollingLevelDB.java:207)
	at org.apache.hadoop.yarn.server.timeline.RollingLevelDB.init(RollingLevelDB.java:200)
	at org.apache.hadoop.yarn.server.timeline.RollingLevelDBTimelineStore.serviceInit(RollingLevelDBTimelineStore.java:321)
	at org.apache.hadoop.service.AbstractService.init(AbstractService.java:163)
	at org.apache.hadoop.yarn.server.timeline.TestRollingLevelDBTimelineStore.setup(TestRollingLevelDBTimelineStore.java:65)

Java HotSpot(TM) 64-Bit Server VM warning: ignoring option MaxPermSize=768m; support was removed
in 8.0
Running org.apache.hadoop.yarn.server.timeline.TestTimelineDataManager
Tests run: 4, Failures: 0, Errors: 0, Skipped: 0, Time elapsed: 5.331 sec - in org.apache.hadoop.yarn.server.timeline.TestTimelineDataManager
Java HotSpot(TM) 64-Bit Server VM warning: ignoring option MaxPermSize=768m; support was removed
in 8.0
Running org.apache.hadoop.yarn.server.timeline.TestRollingLevelDB
Tests run: 2, Failures: 0, Errors: 2, Skipped: 0, Time elapsed: 0.873 sec <<< FAILURE!
- in org.apache.hadoop.yarn.server.timeline.TestRollingLevelDB
testInsertForPreviousPeriodAfterRollPeriodRollsDB(org.apache.hadoop.yarn.server.timeline.TestRollingLevelDB)
 Time elapsed: 0.646 sec  <<< ERROR!
java.lang.UnsupportedOperationException: null
	at org.apache.hadoop.fs.permission.FsPermission$ImmutableFsPermission.applyUMask(FsPermission.java:380)
	at org.apache.hadoop.fs.RawLocalFileSystem.mkOneDirWithMode(RawLocalFileSystem.java:498)
	at org.apache.hadoop.fs.RawLocalFileSystem.mkdirsWithOptionalPermission(RawLocalFileSystem.java:554)
	at org.apache.hadoop.fs.RawLocalFileSystem.mkdirs(RawLocalFileSystem.java:531)
	at org.apache.hadoop.fs.FilterFileSystem.mkdirs(FilterFileSystem.java:314)
	at org.apache.hadoop.yarn.server.timeline.RollingLevelDB.initFileSystem(RollingLevelDB.java:207)
	at org.apache.hadoop.yarn.server.timeline.RollingLevelDB.init(RollingLevelDB.java:200)
	at org.apache.hadoop.yarn.server.timeline.TestRollingLevelDB$MyRollingLevelDB.init(TestRollingLevelDB.java:38)
	at org.apache.hadoop.yarn.server.timeline.TestRollingLevelDB.testInsertForPreviousPeriodAfterRollPeriodRollsDB(TestRollingLevelDB.java:90)

testInsertAfterRollPeriodRollsDB(org.apache.hadoop.yarn.server.timeline.TestRollingLevelDB)
 Time elapsed: 0.024 sec  <<< ERROR!
java.lang.UnsupportedOperationException: null
	at org.apache.hadoop.fs.permission.FsPermission$ImmutableFsPermission.applyUMask(FsPermission.java:380)
	at org.apache.hadoop.fs.RawLocalFileSystem.mkOneDirWithMode(RawLocalFileSystem.java:498)
	at org.apache.hadoop.fs.RawLocalFileSystem.mkdirsWithOptionalPermission(RawLocalFileSystem.java:554)
	at org.apache.hadoop.fs.RawLocalFileSystem.mkdirs(RawLocalFileSystem.java:531)
	at org.apache.hadoop.fs.FilterFileSystem.mkdirs(FilterFileSystem.java:314)
	at org.apache.hadoop.yarn.server.timeline.RollingLevelDB.initFileSystem(RollingLevelDB.java:207)
	at org.apache.hadoop.yarn.server.timeline.RollingLevelDB.init(RollingLevelDB.java:200)
	at org.apache.hadoop.yarn.server.timeline.TestRollingLevelDB$MyRollingLevelDB.init(TestRollingLevelDB.java:38)
	at org.apache.hadoop.yarn.server.timeline.TestRollingLevelDB.testInsertAfterRollPeriodRollsDB(TestRollingLevelDB.java:70)

Java HotSpot(TM) 64-Bit Server VM warning: ignoring option MaxPermSize=768m; support was removed
in 8.0
Running org.apache.hadoop.yarn.server.timeline.webapp.TestCrossOriginFilterInitializer
Tests run: 1, Failures: 0, Errors: 0, Skipped: 0, Time elapsed: 0.277 sec - in org.apache.hadoop.yarn.server.timeline.webapp.TestCrossOriginFilterInitializer
Java HotSpot(TM) 64-Bit Server VM warning: ignoring option MaxPermSize=768m; support was removed
in 8.0
Running org.apache.hadoop.yarn.server.timeline.webapp.TestTimelineWebServicesWithSSL
Tests run: 1, Failures: 0, Errors: 0, Skipped: 0, Time elapsed: 4.233 sec - in org.apache.hadoop.yarn.server.timeline.webapp.TestTimelineWebServicesWithSSL
Java HotSpot(TM) 64-Bit Server VM warning: ignoring option MaxPermSize=768m; support was removed
in 8.0
Running org.apache.hadoop.yarn.server.timeline.webapp.TestTimelineWebServices
Tests run: 27, Failures: 0, Errors: 0, Skipped: 0, Time elapsed: 36.906 sec - in org.apache.hadoop.yarn.server.timeline.webapp.TestTimelineWebServices
Java HotSpot(TM) 64-Bit Server VM warning: ignoring option MaxPermSize=768m; support was removed
in 8.0
Running org.apache.hadoop.yarn.server.timeline.webapp.TestCrossOriginFilter
Tests run: 9, Failures: 0, Errors: 0, Skipped: 0, Time elapsed: 0.371 sec - in org.apache.hadoop.yarn.server.timeline.webapp.TestCrossOriginFilter

Results :

Tests in error: 
  TestRollingLevelDBTimelineStore.setup:65 » UnsupportedOperation
  TestRollingLevelDBTimelineStore.setup:65 » UnsupportedOperation
  TestRollingLevelDBTimelineStore.setup:65 » UnsupportedOperation
  TestRollingLevelDBTimelineStore.setup:65 » UnsupportedOperation
  TestRollingLevelDBTimelineStore.setup:65 » UnsupportedOperation
  TestRollingLevelDBTimelineStore.setup:65 » UnsupportedOperation
  TestRollingLevelDBTimelineStore.setup:65 » UnsupportedOperation
  TestRollingLevelDBTimelineStore.setup:65 » UnsupportedOperation
  TestRollingLevelDBTimelineStore.setup:65 » UnsupportedOperation
  TestRollingLevelDBTimelineStore.setup:65 » UnsupportedOperation
  TestRollingLevelDBTimelineStore.setup:65 » UnsupportedOperation
  TestRollingLevelDBTimelineStore.setup:65 » UnsupportedOperation
  TestRollingLevelDBTimelineStore.setup:65 » UnsupportedOperation
  TestRollingLevelDBTimelineStore.setup:65 » UnsupportedOperation
  TestRollingLevelDBTimelineStore.setup:65 » UnsupportedOperation
  TestRollingLevelDBTimelineStore.setup:65 » UnsupportedOperation
  TestRollingLevelDB.testInsertForPreviousPeriodAfterRollPeriodRollsDB:90 » UnsupportedOperation
  TestRollingLevelDB.testInsertAfterRollPeriodRollsDB:70 » UnsupportedOperation

Tests run: 202, Failures: 0, Errors: 18, Skipped: 0

[INFO] ------------------------------------------------------------------------
[INFO] Reactor Summary:
[INFO] 
[INFO] Apache Hadoop YARN ................................ SUCCESS [  3.048 s]
[INFO] Apache Hadoop YARN API ............................ SUCCESS [01:21 min]
[INFO] Apache Hadoop YARN Common ......................... SUCCESS [02:26 min]
[INFO] Apache Hadoop YARN Server ......................... SUCCESS [  0.058 s]
[INFO] Apache Hadoop YARN Server Common .................. SUCCESS [ 35.324 s]
[INFO] Apache Hadoop YARN NodeManager .................... SUCCESS [06:27 min]
[INFO] Apache Hadoop YARN Web Proxy ...................... SUCCESS [ 14.483 s]
[INFO] Apache Hadoop YARN ApplicationHistoryService ...... FAILURE [02:31 min]
[INFO] Apache Hadoop YARN ResourceManager ................ SKIPPED
[INFO] Apache Hadoop YARN Server Tests ................... SKIPPED
[INFO] Apache Hadoop YARN Client ......................... SKIPPED
[INFO] Apache Hadoop YARN SharedCacheManager ............. SKIPPED
[INFO] Apache Hadoop YARN Applications ................... SKIPPED
[INFO] Apache Hadoop YARN DistributedShell ............... SKIPPED
[INFO] Apache Hadoop YARN Unmanaged Am Launcher .......... SKIPPED
[INFO] Apache Hadoop YARN Site ........................... SKIPPED
[INFO] Apache Hadoop YARN Registry ....................... SKIPPED
[INFO] Apache Hadoop YARN Project ........................ SKIPPED
[INFO] ------------------------------------------------------------------------
[INFO] BUILD FAILURE
[INFO] ------------------------------------------------------------------------
[INFO] Total time: 13:41 min
[INFO] Finished at: 2015-06-18T14:31:39+00:00
[INFO] Final Memory: 92M/1094M
[INFO] ------------------------------------------------------------------------
[ERROR] Failed to execute goal org.apache.maven.plugins:maven-surefire-plugin:2.17:test (default-test)
on project hadoop-yarn-server-applicationhistoryservice: There are test failures.
[ERROR] 
[ERROR] Please refer to <https://builds.apache.org/job/Hadoop-Yarn-trunk-Java8/ws/hadoop-yarn-project/hadoop-yarn/hadoop-yarn-server/hadoop-yarn-server-applicationhistoryservice/target/surefire-reports>
for the individual test results.
[ERROR] -> [Help 1]
[ERROR] 
[ERROR] To see the full stack trace of the errors, re-run Maven with the -e switch.
[ERROR] Re-run Maven using the -X switch to enable full debug logging.
[ERROR] 
[ERROR] For more information about the errors and possible solutions, please read the following
articles:
[ERROR] [Help 1] http://cwiki.apache.org/confluence/display/MAVEN/MojoFailureException
[ERROR] 
[ERROR] After correcting the problems, you can resume the build with the command
[ERROR]   mvn <goals> -rf :hadoop-yarn-server-applicationhistoryservice
Build step 'Execute shell' marked build as failure
Archiving artifacts
Recording test results
Updating HADOOP-11965
Updating YARN-3804
Updating HDFS-8589
Updating HADOOP-7139
Updating MAPREDUCE-6373
Updating HDFS-8608
Updating YARN-3824
Updating HDFS-8238
Updating HDFS-6249
Updating HDFS-7912
Updating HDFS-8615
Updating HDFS-8446

Mime
View raw message