hadoop-yarn-dev mailing list archives

Site index · List index
Message view « Date » · « Thread »
Top « Date » · « Thread »
From Apache Jenkins Server <jenk...@builds.apache.org>
Subject Failed: YARN-2821 PreCommit Build #7770
Date Thu, 07 May 2015 19:17:57 GMT
Jira: https://issues.apache.org/jira/browse/YARN-2821
Build: https://builds.apache.org/job/PreCommit-YARN-Build/7770/

###################################################################################
########################## LAST 60 LINES OF THE CONSOLE ###########################
[...truncated 273 lines...]
|  +1  |    eclipse:eclipse  |  0m 33s    | The patch built with 
|      |                     |            | eclipse:eclipse.
|  +1  |           findbugs  |  0m 35s    | The patch does not introduce any 
|      |                     |            | new Findbugs (version 2.0.3)
|      |                     |            | warnings.
|  -1  |         yarn tests  |  15m 25s   | Tests failed in 
|      |                     |            | hadoop-yarn-applications-distributeds
|      |                     |            | hell.
|      |                     |  50m 56s   | 


             Reason | Tests
 Failed unit tests  |  hadoop.yarn.applications.distributedshell.TestDistributedShellWithNodeLabels

   Timed out tests  |  org.apache.hadoop.yarn.applications.distributedshell.TestDistributedShell



|| Subsystem || Report/Notes ||
============================================================================
| Patch URL | http://issues.apache.org/jira/secure/attachment/12731235/YARN-2821.002.patch
|
| Optional Tests | javadoc javac unit findbugs checkstyle |
| git revision | trunk / daf3e4e |
| checkstyle |  /home/jenkins/jenkins-slave/workspace/PreCommit-YARN-Build/patchprocess/diffcheckstylehadoop-yarn-applications-distributedshell.txt
|
| hadoop-yarn-applications-distributedshell test log | /home/jenkins/jenkins-slave/workspace/PreCommit-YARN-Build/patchprocess/testrun_hadoop-yarn-applications-distributedshell.txt
|
| Test Results | https://builds.apache.org/job/PreCommit-YARN-Build/7770/testReport/ |
| Java | 1.7.0_55 |
| uname | Linux asf907.gq1.ygridcore.net 3.13.0-36-lowlatency #63-Ubuntu SMP PREEMPT Wed Sep
3 21:56:12 UTC 2014 x86_64 x86_64 x86_64 GNU/Linux |


============================================================================
============================================================================
                          Adding comment to JIRA
============================================================================
============================================================================


Comment added.
f367159398ddfad1757cb99ae8d92223f32bf242 logged out


============================================================================
============================================================================
                              Finished build.
============================================================================
============================================================================


Build step 'Execute shell' marked build as failure
Archiving artifacts
Sending artifact delta relative to PreCommit-YARN-Build #7762
Archived 25 artifacts
Archive block size is 32768
Received 59 blocks and 7709711 bytes
Compression is 20.0%
Took 1.6 sec
[description-setter] Could not determine description.
Recording test results
Publish JUnit test result report is waiting for a checkpoint on PreCommit-YARN-Build #7769
Email was triggered for: Failure
Sending email for trigger: Failure



###################################################################################
############################## FAILED TESTS (if any) ##############################
1 tests failed.
FAILED:  org.apache.hadoop.yarn.applications.distributedshell.TestDistributedShellWithNodeLabels.testDSShellWithNodeLabelExpression

Error Message:
java.io.IOException: ApplicationHistoryServer failed to start. Final state is STOPPED

Stack Trace:
org.apache.hadoop.yarn.exceptions.YarnRuntimeException: java.io.IOException: ApplicationHistoryServer
failed to start. Final state is STOPPED
	at org.apache.hadoop.yarn.server.MiniYARNCluster$ApplicationHistoryServerWrapper.serviceStart(MiniYARNCluster.java:711)
	at org.apache.hadoop.service.AbstractService.start(AbstractService.java:193)
	at org.apache.hadoop.service.CompositeService.serviceStart(CompositeService.java:120)
	at org.apache.hadoop.service.AbstractService.start(AbstractService.java:193)
	at org.apache.hadoop.yarn.applications.distributedshell.TestDistributedShell.setupInternal(TestDistributedShell.java:91)
	at org.apache.hadoop.yarn.applications.distributedshell.TestDistributedShellWithNodeLabels.setup(TestDistributedShellWithNodeLabels.java:47)



Mime
  • Unnamed multipart/mixed (inline, None, 0 bytes)
View raw message