hadoop-yarn-dev mailing list archives

Site index · List index
Message view « Date » · « Thread »
Top « Date » · « Thread »
From Apache Jenkins Server <jenk...@builds.apache.org>
Subject Failed: YARN-3476 PreCommit Build #7794
Date Fri, 08 May 2015 09:05:25 GMT
Jira: https://issues.apache.org/jira/browse/YARN-3476
Build: https://builds.apache.org/job/PreCommit-YARN-Build/7794/

###################################################################################
########################## LAST 60 LINES OF THE CONSOLE ###########################
[...truncated 278 lines...]
|      |                     |            | issues.
|  -1  |         whitespace  |  0m 0s     | The patch has 2 line(s) that end in 
|      |                     |            | whitespace. Use git apply
|      |                     |            | --whitespace=fix.
|  +1  |            install  |  1m 34s    | mvn install still works. 
|  +1  |    eclipse:eclipse  |  0m 34s    | The patch built with 
|      |                     |            | eclipse:eclipse.
|  +1  |           findbugs  |  1m 1s     | The patch does not introduce any 
|      |                     |            | new Findbugs (version 2.0.3)
|      |                     |            | warnings.
|  +1  |         yarn tests  |  5m 52s    | Tests passed in 
|      |                     |            | hadoop-yarn-server-nodemanager.
|      |                     |  41m 57s   | 


|| Subsystem || Report/Notes ||
============================================================================
| Patch URL | http://issues.apache.org/jira/secure/attachment/12731375/0002-YARN-3476.patch
|
| Optional Tests | javadoc javac unit findbugs checkstyle |
| git revision | trunk / f26700f |
| whitespace | /home/jenkins/jenkins-slave/workspace/PreCommit-YARN-Build/patchprocess/whitespace.txt
|
| hadoop-yarn-server-nodemanager test log | /home/jenkins/jenkins-slave/workspace/PreCommit-YARN-Build/patchprocess/testrun_hadoop-yarn-server-nodemanager.txt
|
| Test Results | https://builds.apache.org/job/PreCommit-YARN-Build/7794/testReport/ |
| Java | 1.7.0_55 |
| uname | Linux asf901.gq1.ygridcore.net 3.13.0-36-lowlatency #63-Ubuntu SMP PREEMPT Wed Sep
3 21:56:12 UTC 2014 x86_64 x86_64 x86_64 GNU/Linux |


============================================================================
============================================================================
                          Adding comment to JIRA
============================================================================
============================================================================


Unable to log in to server: https://issues.apache.org/jira/rpc/soap/jirasoapservice-v2 with
user: hadoopqa.
 Cause: com.atlassian.jira.rpc.exception.RemoteAuthenticationException: Attempt to log in
user 'hadoopqa' failed. The maximum number of failed login attempts has been reached. Please
log into the application through the web interface to reset the number of failed login attempts.
Unable to log in to server: https://issues.apache.org/jira/rpc/soap/jirasoapservice-v2 with
user: hadoopqa.
 Cause: com.atlassian.jira.rpc.exception.RemoteAuthenticationException: Attempt to log in
user 'hadoopqa' failed. The maximum number of failed login attempts has been reached. Please
log into the application through the web interface to reset the number of failed login attempts.


============================================================================
============================================================================
                              Finished build.
============================================================================
============================================================================


Build step 'Execute shell' marked build as failure
Archiving artifacts
Sending artifact delta relative to PreCommit-YARN-Build #7789
Archived 24 artifacts
Archive block size is 32768
Received 287 blocks and 2327083 bytes
Compression is 80.2%
Took 2.3 sec
[description-setter] Could not determine description.
Recording test results
Email was triggered for: Failure
Sending email for trigger: Failure



###################################################################################
############################## FAILED TESTS (if any) ##############################
All tests passed
Mime
  • Unnamed multipart/mixed (inline, None, 0 bytes)
View raw message