hadoop-yarn-dev mailing list archives

Site index · List index
Message view « Date » · « Thread »
Top « Date » · « Thread »
From Apache Jenkins Server <jenk...@builds.apache.org>
Subject Failed: YARN-3721 PreCommit Build #8105
Date Thu, 28 May 2015 00:29:28 GMT
Jira: https://issues.apache.org/jira/browse/YARN-3721
Build: https://builds.apache.org/job/PreCommit-YARN-Build/8105/

###################################################################################
########################## LAST 60 LINES OF THE CONSOLE ###########################
[...truncated 241 lines...]
|      |                     |            | messages.
|  +1  |      release audit  |  0m 23s    | The applied patch does not increase 
|      |                     |            | the total number of release audit
|      |                     |            | warnings.
|  +1  |         whitespace  |  0m 0s     | The patch has no lines that end in 
|      |                     |            | whitespace.
|  +1  |            install  |  1m 39s    | mvn install still works. 
|  +1  |    eclipse:eclipse  |  0m 41s    | The patch built with 
|      |                     |            | eclipse:eclipse.
|  -1  |         yarn tests  |  1m 14s    | Tests failed in 
|      |                     |            | hadoop-yarn-server-timelineservice.
|      |                     |  37m 33s   | 


             Reason | Tests
 Failed unit tests  |  hadoop.yarn.server.timelineservice.storage.TestHBaseTimelineWriterImpl



|| Subsystem || Report/Notes ||
============================================================================
| Patch URL | http://issues.apache.org/jira/secure/attachment/12735700/YARN-3721-YARN-2928.002.patch
|
| Optional Tests | javadoc javac unit |
| git revision | YARN-2928 / e19566a |
| hadoop-yarn-server-timelineservice test log | /home/jenkins/jenkins-slave/workspace/PreCommit-YARN-Build/patchprocess/testrun_hadoop-yarn-server-timelineservice.txt
|
| Test Results | https://builds.apache.org/job/PreCommit-YARN-Build/8105/testReport/ |
| Java | 1.7.0_55 |
| uname | Linux asf903.gq1.ygridcore.net 3.13.0-36-lowlatency #63-Ubuntu SMP PREEMPT Wed Sep
3 21:56:12 UTC 2014 x86_64 x86_64 x86_64 GNU/Linux |


============================================================================
============================================================================
                          Adding comment to JIRA
============================================================================
============================================================================


Comment added.
13049edd07381e83f80b665e1520ee42a280b79d logged out


============================================================================
============================================================================
                              Finished build.
============================================================================
============================================================================


Build step 'Execute shell' marked build as failure
Archiving artifacts
Sending artifact delta relative to PreCommit-YARN-Build #8095
Archived 16 artifacts
Archive block size is 32768
Received 19 blocks and 8872965 bytes
Compression is 6.6%
Took 5.2 sec
[description-setter] Could not determine description.
Recording test results
Email was triggered for: Failure
Sending email for trigger: Failure



###################################################################################
############################## FAILED TESTS (if any) ##############################
1 tests failed.
FAILED:  org.apache.hadoop.yarn.server.timelineservice.storage.TestHBaseTimelineWriterImpl.testWriteEntityToHBase

Error Message:
expected:<1> but was:<6>

Stack Trace:
java.lang.AssertionError: expected:<1> but was:<6>
	at org.junit.Assert.fail(Assert.java:88)
	at org.junit.Assert.failNotEquals(Assert.java:743)
	at org.junit.Assert.assertEquals(Assert.java:118)
	at org.junit.Assert.assertEquals(Assert.java:555)
	at org.junit.Assert.assertEquals(Assert.java:542)
	at org.apache.hadoop.yarn.server.timelineservice.storage.TestHBaseTimelineWriterImpl.checkMetricsTimeseries(TestHBaseTimelineWriterImpl.java:219)
	at org.apache.hadoop.yarn.server.timelineservice.storage.TestHBaseTimelineWriterImpl.testWriteEntityToHBase(TestHBaseTimelineWriterImpl.java:204)



Mime
  • Unnamed multipart/mixed (inline, None, 0 bytes)
View raw message