hadoop-yarn-dev mailing list archives

Site index · List index
Message view « Date » · « Thread »
Top « Date » · « Thread »
From Apache Jenkins Server <jenk...@builds.apache.org>
Subject Failed: YARN-2556 PreCommit Build #8116
Date Thu, 28 May 2015 20:47:19 GMT
Jira: https://issues.apache.org/jira/browse/YARN-2556
Build: https://builds.apache.org/job/PreCommit-YARN-Build/8116/

###################################################################################
########################## LAST 60 LINES OF THE CONSOLE ###########################
[...truncated 267 lines...]
|  +1  |           findbugs  |  0m 55s    | The patch does not introduce any 
|      |                     |            | new Findbugs (version 3.0.0)
|      |                     |            | warnings.
|  -1  |    mapreduce tests  |  86m 41s   | Tests failed in 
|      |                     |            | hadoop-mapreduce-client-jobclient.
|      |                     |  106m 46s  | 


             Reason | Tests
 Failed unit tests  |  hadoop.mapred.join.TestDatamerge 
                    |  hadoop.mapred.TestLazyOutput 
                    |  hadoop.mapred.TestReduceFetch 
                    |  hadoop.mapred.TestJobName 
   Timed out tests  |  org.apache.hadoop.mapreduce.v2.TestMRJobs 
                    |  org.apache.hadoop.mapred.TestMRIntermediateDataEncryption 


|| Subsystem || Report/Notes ||
============================================================================
| Patch URL | http://issues.apache.org/jira/secure/attachment/12735924/YARN-2556.11.patch
|
| Optional Tests | javac unit findbugs checkstyle |
| git revision | trunk / 246cefa |
| whitespace | /home/jenkins/jenkins-slave/workspace/PreCommit-YARN-Build/patchprocess/whitespace.txt
|
| hadoop-mapreduce-client-jobclient test log | /home/jenkins/jenkins-slave/workspace/PreCommit-YARN-Build/patchprocess/testrun_hadoop-mapreduce-client-jobclient.txt
|
| Test Results | https://builds.apache.org/job/PreCommit-YARN-Build/8116/testReport/ |
| Java | 1.7.0_55 |
| uname | Linux asf904.gq1.ygridcore.net 3.13.0-36-lowlatency #63-Ubuntu SMP PREEMPT Wed Sep
3 21:56:12 UTC 2014 x86_64 x86_64 x86_64 GNU/Linux |


============================================================================
============================================================================
                          Adding comment to JIRA
============================================================================
============================================================================


Comment added.
4d9f92a2e275228c7607fc5e9362739ee54dae89 logged out


============================================================================
============================================================================
                              Finished build.
============================================================================
============================================================================


Build step 'Execute shell' marked build as failure
Archiving artifacts
Sending artifact delta relative to PreCommit-YARN-Build #8110
Archived 27 artifacts
Archive block size is 32768
Received 41 blocks and 3215809 bytes
Compression is 29.5%
Took 0.87 sec
[description-setter] Could not determine description.
Recording test results
Email was triggered for: Failure
Sending email for trigger: Failure



###################################################################################
############################## FAILED TESTS (if any) ##############################
9 tests failed.
FAILED:  org.apache.hadoop.mapred.TestJobName.testComplexNameWithRegex

Error Message:
org/apache/hadoop/util/ShutdownThreadsHelper

Stack Trace:
java.lang.NoClassDefFoundError: org/apache/hadoop/util/ShutdownThreadsHelper
	at org.apache.hadoop.mapreduce.v2.hs.HistoryFileManager.serviceStop(HistoryFileManager.java:635)
	at org.apache.hadoop.service.AbstractService.stop(AbstractService.java:221)
	at org.apache.hadoop.mapreduce.v2.hs.JobHistory.serviceStop(JobHistory.java:171)
	at org.apache.hadoop.service.AbstractService.stop(AbstractService.java:221)
	at org.apache.hadoop.service.ServiceOperations.stop(ServiceOperations.java:52)
	at org.apache.hadoop.service.ServiceOperations.stopQuietly(ServiceOperations.java:80)
	at org.apache.hadoop.service.CompositeService.stop(CompositeService.java:157)
	at org.apache.hadoop.service.CompositeService.serviceStop(CompositeService.java:131)
	at org.apache.hadoop.mapreduce.v2.hs.JobHistoryServer.serviceStop(JobHistoryServer.java:201)
	at org.apache.hadoop.service.AbstractService.stop(AbstractService.java:221)
	at org.apache.hadoop.mapreduce.v2.MiniMRYarnCluster$JobHistoryServerWrapper.serviceStop(MiniMRYarnCluster.java:248)
	at org.apache.hadoop.service.AbstractService.stop(AbstractService.java:221)
	at org.apache.hadoop.service.ServiceOperations.stop(ServiceOperations.java:52)
	at org.apache.hadoop.service.ServiceOperations.stopQuietly(ServiceOperations.java:80)
	at org.apache.hadoop.service.CompositeService.stop(CompositeService.java:157)
	at org.apache.hadoop.service.CompositeService.serviceStop(CompositeService.java:131)
	at org.apache.hadoop.service.AbstractService.stop(AbstractService.java:221)
	at org.apache.hadoop.mapred.MiniMRYarnClusterAdapter.stop(MiniMRYarnClusterAdapter.java:55)
	at org.apache.hadoop.mapred.MiniMRCluster.shutdown(MiniMRCluster.java:267)
	at org.apache.hadoop.mapred.ClusterMapReduceTestCase.stopCluster(ClusterMapReduceTestCase.java:128)
	at org.apache.hadoop.mapred.ClusterMapReduceTestCase.tearDown(ClusterMapReduceTestCase.java:143)
	at junit.framework.TestCase.runBare(TestCase.java:146)
	at junit.framework.TestResult$1.protect(TestResult.java:122)
	at junit.framework.TestResult.runProtected(TestResult.java:142)
	at junit.framework.TestResult.run(TestResult.java:125)
	at junit.framework.TestCase.run(TestCase.java:129)
	at junit.framework.TestSuite.runTest(TestSuite.java:255)
	at junit.framework.TestSuite.run(TestSuite.java:250)
	at org.junit.internal.runners.JUnit38ClassRunner.run(JUnit38ClassRunner.java:84)
	at org.apache.maven.surefire.junit4.JUnit4Provider.execute(JUnit4Provider.java:264)
	at org.apache.maven.surefire.junit4.JUnit4Provider.executeTestSet(JUnit4Provider.java:153)
	at org.apache.maven.surefire.junit4.JUnit4Provider.invoke(JUnit4Provider.java:124)
	at org.apache.maven.surefire.booter.ForkedBooter.invokeProviderInSameClassLoader(ForkedBooter.java:200)
	at org.apache.maven.surefire.booter.ForkedBooter.runSuitesInProcess(ForkedBooter.java:153)
	at org.apache.maven.surefire.booter.ForkedBooter.main(ForkedBooter.java:103)
Caused by: java.lang.ClassNotFoundException: org.apache.hadoop.util.ShutdownThreadsHelper
	at java.net.URLClassLoader$1.run(URLClassLoader.java:366)
	at java.net.URLClassLoader$1.run(URLClassLoader.java:355)
	at java.security.AccessController.doPrivileged(Native Method)
	at java.net.URLClassLoader.findClass(URLClassLoader.java:354)
	at java.lang.ClassLoader.loadClass(ClassLoader.java:425)
	at sun.misc.Launcher$AppClassLoader.loadClass(Launcher.java:308)
	at java.lang.ClassLoader.loadClass(ClassLoader.java:358)
	at org.apache.hadoop.mapreduce.v2.hs.HistoryFileManager.serviceStop(HistoryFileManager.java:635)
	at org.apache.hadoop.service.AbstractService.stop(AbstractService.java:221)
	at org.apache.hadoop.mapreduce.v2.hs.JobHistory.serviceStop(JobHistory.java:171)
	at org.apache.hadoop.service.AbstractService.stop(AbstractService.java:221)
	at org.apache.hadoop.service.ServiceOperations.stop(ServiceOperations.java:52)
	at org.apache.hadoop.service.ServiceOperations.stopQuietly(ServiceOperations.java:80)
	at org.apache.hadoop.service.CompositeService.stop(CompositeService.java:157)
	at org.apache.hadoop.service.CompositeService.serviceStop(CompositeService.java:131)
	at org.apache.hadoop.mapreduce.v2.hs.JobHistoryServer.serviceStop(JobHistoryServer.java:201)
	at org.apache.hadoop.service.AbstractService.stop(AbstractService.java:221)
	at org.apache.hadoop.mapreduce.v2.MiniMRYarnCluster$JobHistoryServerWrapper.serviceStop(MiniMRYarnCluster.java:248)
	at org.apache.hadoop.service.AbstractService.stop(AbstractService.java:221)
	at org.apache.hadoop.service.ServiceOperations.stop(ServiceOperations.java:52)
	at org.apache.hadoop.service.ServiceOperations.stopQuietly(ServiceOperations.java:80)
	at org.apache.hadoop.service.CompositeService.stop(CompositeService.java:157)
	at org.apache.hadoop.service.CompositeService.serviceStop(CompositeService.java:131)
	at org.apache.hadoop.service.AbstractService.stop(AbstractService.java:221)
	at org.apache.hadoop.mapred.MiniMRYarnClusterAdapter.stop(MiniMRYarnClusterAdapter.java:55)
	at org.apache.hadoop.mapred.MiniMRCluster.shutdown(MiniMRCluster.java:267)
	at org.apache.hadoop.mapred.ClusterMapReduceTestCase.stopCluster(ClusterMapReduceTestCase.java:128)
	at org.apache.hadoop.mapred.ClusterMapReduceTestCase.tearDown(ClusterMapReduceTestCase.java:143)
	at junit.framework.TestCase.runBare(TestCase.java:146)
	at junit.framework.TestResult$1.protect(TestResult.java:122)
	at junit.framework.TestResult.runProtected(TestResult.java:142)
	at junit.framework.TestResult.run(TestResult.java:125)
	at junit.framework.TestCase.run(TestCase.java:129)
	at junit.framework.TestSuite.runTest(TestSuite.java:255)
	at junit.framework.TestSuite.run(TestSuite.java:250)
	at org.junit.internal.runners.JUnit38ClassRunner.run(JUnit38ClassRunner.java:84)
	at org.apache.maven.surefire.junit4.JUnit4Provider.execute(JUnit4Provider.java:264)
	at org.apache.maven.surefire.junit4.JUnit4Provider.executeTestSet(JUnit4Provider.java:153)
	at org.apache.maven.surefire.junit4.JUnit4Provider.invoke(JUnit4Provider.java:124)
	at org.apache.maven.surefire.booter.ForkedBooter.invokeProviderInSameClassLoader(ForkedBooter.java:200)
	at org.apache.maven.surefire.booter.ForkedBooter.runSuitesInProcess(ForkedBooter.java:153)
	at org.apache.maven.surefire.booter.ForkedBooter.main(ForkedBooter.java:103)


FAILED:  org.apache.hadoop.mapred.TestJobName.testComplexName

Error Message:
could not cleanup test dir: org.apache.hadoop.fs.UnsupportedFileSystemException: fs.AbstractFileSystem.file.impl=null:
No AbstractFileSystem configured for scheme: file

Stack Trace:
org.apache.hadoop.yarn.exceptions.YarnRuntimeException: could not cleanup test dir: org.apache.hadoop.fs.UnsupportedFileSystemException:
fs.AbstractFileSystem.file.impl=null: No AbstractFileSystem configured for scheme: file
	at org.apache.hadoop.yarn.server.MiniYARNCluster.<init>(MiniYARNCluster.java:148)
	at org.apache.hadoop.mapreduce.v2.MiniMRYarnCluster.<init>(MiniMRYarnCluster.java:79)
	at org.apache.hadoop.mapreduce.v2.MiniMRYarnCluster.<init>(MiniMRYarnCluster.java:75)
	at org.apache.hadoop.mapred.MiniMRClientClusterFactory.create(MiniMRClientClusterFactory.java:73)
	at org.apache.hadoop.mapred.MiniMRCluster.<init>(MiniMRCluster.java:187)
	at org.apache.hadoop.mapred.MiniMRCluster.<init>(MiniMRCluster.java:175)
	at org.apache.hadoop.mapred.MiniMRCluster.<init>(MiniMRCluster.java:167)
	at org.apache.hadoop.mapred.ClusterMapReduceTestCase$ConfigurableMiniMRCluster.<init>(ClusterMapReduceTestCase.java:101)
	at org.apache.hadoop.mapred.ClusterMapReduceTestCase.startCluster(ClusterMapReduceTestCase.java:86)
	at org.apache.hadoop.mapred.ClusterMapReduceTestCase.setUp(ClusterMapReduceTestCase.java:56)
	at junit.framework.TestCase.runBare(TestCase.java:139)
	at junit.framework.TestResult$1.protect(TestResult.java:122)
	at junit.framework.TestResult.runProtected(TestResult.java:142)
	at junit.framework.TestResult.run(TestResult.java:125)
	at junit.framework.TestCase.run(TestCase.java:129)
	at junit.framework.TestSuite.runTest(TestSuite.java:255)
	at junit.framework.TestSuite.run(TestSuite.java:250)
	at org.junit.internal.runners.JUnit38ClassRunner.run(JUnit38ClassRunner.java:84)
	at org.apache.maven.surefire.junit4.JUnit4Provider.execute(JUnit4Provider.java:264)
	at org.apache.maven.surefire.junit4.JUnit4Provider.executeTestSet(JUnit4Provider.java:153)
	at org.apache.maven.surefire.junit4.JUnit4Provider.invoke(JUnit4Provider.java:124)
	at org.apache.maven.surefire.booter.ForkedBooter.invokeProviderInSameClassLoader(ForkedBooter.java:200)
	at org.apache.maven.surefire.booter.ForkedBooter.runSuitesInProcess(ForkedBooter.java:153)
	at org.apache.maven.surefire.booter.ForkedBooter.main(ForkedBooter.java:103)
Caused by: org.apache.hadoop.fs.UnsupportedFileSystemException: fs.AbstractFileSystem.file.impl=null:
No AbstractFileSystem configured for scheme: file
	at org.apache.hadoop.fs.AbstractFileSystem.createFileSystem(AbstractFileSystem.java:161)
	at org.apache.hadoop.fs.AbstractFileSystem.get(AbstractFileSystem.java:250)
	at org.apache.hadoop.fs.FileContext$2.run(FileContext.java:325)
	at org.apache.hadoop.fs.FileContext$2.run(FileContext.java:322)
	at java.security.AccessController.doPrivileged(Native Method)
	at javax.security.auth.Subject.doAs(Subject.java:415)
	at org.apache.hadoop.security.UserGroupInformation.doAs(UserGroupInformation.java:1666)
	at org.apache.hadoop.fs.FileContext.getAbstractFileSystem(FileContext.java:322)
	at org.apache.hadoop.fs.FileContext.getFileContext(FileContext.java:439)
	at org.apache.hadoop.fs.FileContext.getFileContext(FileContext.java:416)
	at org.apache.hadoop.fs.FileContext.getLocalFSFileContext(FileContext.java:402)
	at org.apache.hadoop.yarn.server.MiniYARNCluster.<init>(MiniYARNCluster.java:144)
	at org.apache.hadoop.mapreduce.v2.MiniMRYarnCluster.<init>(MiniMRYarnCluster.java:79)
	at org.apache.hadoop.mapreduce.v2.MiniMRYarnCluster.<init>(MiniMRYarnCluster.java:75)
	at org.apache.hadoop.mapred.MiniMRClientClusterFactory.create(MiniMRClientClusterFactory.java:73)
	at org.apache.hadoop.mapred.MiniMRCluster.<init>(MiniMRCluster.java:187)
	at org.apache.hadoop.mapred.MiniMRCluster.<init>(MiniMRCluster.java:175)
	at org.apache.hadoop.mapred.MiniMRCluster.<init>(MiniMRCluster.java:167)
	at org.apache.hadoop.mapred.ClusterMapReduceTestCase$ConfigurableMiniMRCluster.<init>(ClusterMapReduceTestCase.java:101)
	at org.apache.hadoop.mapred.ClusterMapReduceTestCase.startCluster(ClusterMapReduceTestCase.java:86)
	at org.apache.hadoop.mapred.ClusterMapReduceTestCase.setUp(ClusterMapReduceTestCase.java:56)
	at junit.framework.TestCase.runBare(TestCase.java:139)
	at junit.framework.TestResult$1.protect(TestResult.java:122)
	at junit.framework.TestResult.runProtected(TestResult.java:142)
	at junit.framework.TestResult.run(TestResult.java:125)
	at junit.framework.TestCase.run(TestCase.java:129)
	at junit.framework.TestSuite.runTest(TestSuite.java:255)
	at junit.framework.TestSuite.run(TestSuite.java:250)
	at org.junit.internal.runners.JUnit38ClassRunner.run(JUnit38ClassRunner.java:84)
	at org.apache.maven.surefire.junit4.JUnit4Provider.execute(JUnit4Provider.java:264)
	at org.apache.maven.surefire.junit4.JUnit4Provider.executeTestSet(JUnit4Provider.java:153)
	at org.apache.maven.surefire.junit4.JUnit4Provider.invoke(JUnit4Provider.java:124)
	at org.apache.maven.surefire.booter.ForkedBooter.invokeProviderInSameClassLoader(ForkedBooter.java:200)
	at org.apache.maven.surefire.booter.ForkedBooter.runSuitesInProcess(ForkedBooter.java:153)
	at org.apache.maven.surefire.booter.ForkedBooter.main(ForkedBooter.java:103)


FAILED:  org.apache.hadoop.mapred.TestLazyOutput.testLazyOutput

Error Message:
org/apache/hadoop/mapred/Clock

Stack Trace:
java.lang.NoClassDefFoundError: org/apache/hadoop/mapred/Clock
	at java.net.URLClassLoader$1.run(URLClassLoader.java:366)
	at java.net.URLClassLoader$1.run(URLClassLoader.java:355)
	at java.security.AccessController.doPrivileged(Native Method)
	at java.net.URLClassLoader.findClass(URLClassLoader.java:354)
	at java.lang.ClassLoader.loadClass(ClassLoader.java:425)
	at sun.misc.Launcher$AppClassLoader.loadClass(Launcher.java:308)
	at java.lang.ClassLoader.loadClass(ClassLoader.java:358)
	at org.apache.hadoop.mapred.MiniMRCluster.<init>(MiniMRCluster.java:175)
	at org.apache.hadoop.mapred.MiniMRCluster.<init>(MiniMRCluster.java:167)
	at org.apache.hadoop.mapred.MiniMRCluster.<init>(MiniMRCluster.java:159)
	at org.apache.hadoop.mapred.MiniMRCluster.<init>(MiniMRCluster.java:152)
	at org.apache.hadoop.mapred.MiniMRCluster.<init>(MiniMRCluster.java:145)
	at org.apache.hadoop.mapred.MiniMRCluster.<init>(MiniMRCluster.java:138)
	at org.apache.hadoop.mapred.MiniMRCluster.<init>(MiniMRCluster.java:133)
	at org.apache.hadoop.mapred.TestLazyOutput.testLazyOutput(TestLazyOutput.java:147)


FAILED:  org.apache.hadoop.mapred.TestReduceFetchFromPartialMem$1.org.apache.hadoop.mapred.TestReduceFetchFromPartialMem

Error Message:
org/apache/hadoop/yarn/event/EventHandler

Stack Trace:
java.lang.NoClassDefFoundError: org/apache/hadoop/yarn/event/EventHandler
	at java.net.URLClassLoader$1.run(URLClassLoader.java:366)
	at java.net.URLClassLoader$1.run(URLClassLoader.java:355)
	at java.security.AccessController.doPrivileged(Native Method)
	at java.net.URLClassLoader.findClass(URLClassLoader.java:354)
	at java.lang.ClassLoader.loadClass(ClassLoader.java:425)
	at sun.misc.Launcher$AppClassLoader.loadClass(Launcher.java:308)
	at java.lang.ClassLoader.loadClass(ClassLoader.java:358)
	at java.lang.ClassLoader.defineClass1(Native Method)
	at java.lang.ClassLoader.defineClass(ClassLoader.java:800)
	at java.security.SecureClassLoader.defineClass(SecureClassLoader.java:142)
	at java.net.URLClassLoader.defineClass(URLClassLoader.java:449)
	at java.net.URLClassLoader.access$100(URLClassLoader.java:71)
	at java.net.URLClassLoader$1.run(URLClassLoader.java:361)
	at java.net.URLClassLoader$1.run(URLClassLoader.java:355)
	at java.security.AccessController.doPrivileged(Native Method)
	at java.net.URLClassLoader.findClass(URLClassLoader.java:354)
	at java.lang.ClassLoader.loadClass(ClassLoader.java:425)
	at sun.misc.Launcher$AppClassLoader.loadClass(Launcher.java:308)
	at java.lang.ClassLoader.loadClass(ClassLoader.java:358)
	at java.lang.ClassLoader.defineClass1(Native Method)
	at java.lang.ClassLoader.defineClass(ClassLoader.java:800)
	at java.security.SecureClassLoader.defineClass(SecureClassLoader.java:142)
	at java.net.URLClassLoader.defineClass(URLClassLoader.java:449)
	at java.net.URLClassLoader.access$100(URLClassLoader.java:71)
	at java.net.URLClassLoader$1.run(URLClassLoader.java:361)
	at java.net.URLClassLoader$1.run(URLClassLoader.java:355)
	at java.security.AccessController.doPrivileged(Native Method)
	at java.net.URLClassLoader.findClass(URLClassLoader.java:354)
	at java.lang.ClassLoader.loadClass(ClassLoader.java:425)
	at sun.misc.Launcher$AppClassLoader.loadClass(Launcher.java:308)
	at java.lang.ClassLoader.loadClass(ClassLoader.java:358)
	at org.apache.hadoop.mapred.MiniMRClientClusterFactory.create(MiniMRClientClusterFactory.java:58)
	at org.apache.hadoop.mapred.MiniMRCluster.<init>(MiniMRCluster.java:187)
	at org.apache.hadoop.mapred.MiniMRCluster.<init>(MiniMRCluster.java:175)
	at org.apache.hadoop.mapred.MiniMRCluster.<init>(MiniMRCluster.java:167)
	at org.apache.hadoop.mapred.MiniMRCluster.<init>(MiniMRCluster.java:159)
	at org.apache.hadoop.mapred.MiniMRCluster.<init>(MiniMRCluster.java:152)
	at org.apache.hadoop.mapred.MiniMRCluster.<init>(MiniMRCluster.java:145)
	at org.apache.hadoop.mapred.MiniMRCluster.<init>(MiniMRCluster.java:138)
	at org.apache.hadoop.mapred.MiniMRCluster.<init>(MiniMRCluster.java:133)
	at org.apache.hadoop.mapred.TestReduceFetchFromPartialMem$1.setUp(TestReduceFetchFromPartialMem.java:61)


FAILED:  org.apache.hadoop.mapred.join.TestDatamerge.testNestedJoin

Error Message:
org/apache/hadoop/yarn/exceptions/YarnRuntimeException

Stack Trace:
java.lang.NoClassDefFoundError: org/apache/hadoop/yarn/exceptions/YarnRuntimeException
	at java.net.URLClassLoader$1.run(URLClassLoader.java:366)
	at java.net.URLClassLoader$1.run(URLClassLoader.java:355)
	at java.security.AccessController.doPrivileged(Native Method)
	at java.net.URLClassLoader.findClass(URLClassLoader.java:354)
	at java.lang.ClassLoader.loadClass(ClassLoader.java:425)
	at sun.misc.Launcher$AppClassLoader.loadClass(Launcher.java:308)
	at java.lang.ClassLoader.loadClass(ClassLoader.java:358)
	at org.apache.hadoop.mapred.LocalDistributedCacheManager.setup(LocalDistributedCacheManager.java:93)
	at org.apache.hadoop.mapred.LocalJobRunner$Job.<init>(LocalJobRunner.java:164)
	at org.apache.hadoop.mapred.LocalJobRunner.submitJob(LocalJobRunner.java:759)
	at org.apache.hadoop.mapreduce.JobSubmitter.submitJobInternal(JobSubmitter.java:241)
	at org.apache.hadoop.mapreduce.Job$10.run(Job.java:1290)
	at org.apache.hadoop.mapreduce.Job$10.run(Job.java:1287)
	at java.security.AccessController.doPrivileged(Native Method)
	at javax.security.auth.Subject.doAs(Subject.java:415)
	at org.apache.hadoop.security.UserGroupInformation.doAs(UserGroupInformation.java:1666)
	at org.apache.hadoop.mapreduce.Job.submit(Job.java:1287)
	at org.apache.hadoop.mapred.JobClient$1.run(JobClient.java:575)
	at org.apache.hadoop.mapred.JobClient$1.run(JobClient.java:570)
	at java.security.AccessController.doPrivileged(Native Method)
	at javax.security.auth.Subject.doAs(Subject.java:415)
	at org.apache.hadoop.security.UserGroupInformation.doAs(UserGroupInformation.java:1666)
	at org.apache.hadoop.mapred.JobClient.submitJobInternal(JobClient.java:570)
	at org.apache.hadoop.mapred.JobClient.submitJob(JobClient.java:561)
	at org.apache.hadoop.mapred.JobClient.runJob(JobClient.java:864)
	at org.apache.hadoop.mapred.join.TestDatamerge.testNestedJoin(TestDatamerge.java:319)


FAILED:  org.apache.hadoop.mapred.join.TestDatamerge.testEmptyJoin

Error Message:
org/apache/hadoop/yarn/exceptions/YarnRuntimeException

Stack Trace:
java.lang.NoClassDefFoundError: org/apache/hadoop/yarn/exceptions/YarnRuntimeException
	at java.net.URLClassLoader$1.run(URLClassLoader.java:366)
	at java.net.URLClassLoader$1.run(URLClassLoader.java:355)
	at java.security.AccessController.doPrivileged(Native Method)
	at java.net.URLClassLoader.findClass(URLClassLoader.java:354)
	at java.lang.ClassLoader.loadClass(ClassLoader.java:425)
	at sun.misc.Launcher$AppClassLoader.loadClass(Launcher.java:308)
	at java.lang.ClassLoader.loadClass(ClassLoader.java:358)
	at org.apache.hadoop.mapred.LocalDistributedCacheManager.setup(LocalDistributedCacheManager.java:93)
	at org.apache.hadoop.mapred.LocalJobRunner$Job.<init>(LocalJobRunner.java:164)
	at org.apache.hadoop.mapred.LocalJobRunner.submitJob(LocalJobRunner.java:759)
	at org.apache.hadoop.mapreduce.JobSubmitter.submitJobInternal(JobSubmitter.java:241)
	at org.apache.hadoop.mapreduce.Job$10.run(Job.java:1290)
	at org.apache.hadoop.mapreduce.Job$10.run(Job.java:1287)
	at java.security.AccessController.doPrivileged(Native Method)
	at javax.security.auth.Subject.doAs(Subject.java:415)
	at org.apache.hadoop.security.UserGroupInformation.doAs(UserGroupInformation.java:1666)
	at org.apache.hadoop.mapreduce.Job.submit(Job.java:1287)
	at org.apache.hadoop.mapred.JobClient$1.run(JobClient.java:575)
	at org.apache.hadoop.mapred.JobClient$1.run(JobClient.java:570)
	at java.security.AccessController.doPrivileged(Native Method)
	at javax.security.auth.Subject.doAs(Subject.java:415)
	at org.apache.hadoop.security.UserGroupInformation.doAs(UserGroupInformation.java:1666)
	at org.apache.hadoop.mapred.JobClient.submitJobInternal(JobClient.java:570)
	at org.apache.hadoop.mapred.JobClient.submitJob(JobClient.java:561)
	at org.apache.hadoop.mapred.JobClient.runJob(JobClient.java:864)
	at org.apache.hadoop.mapred.join.TestDatamerge.testEmptyJoin(TestDatamerge.java:367)


FAILED:  org.apache.hadoop.mapred.join.TestDatamerge.testSimpleOuterJoin

Error Message:
org/apache/hadoop/yarn/exceptions/YarnRuntimeException

Stack Trace:
java.lang.NoClassDefFoundError: org/apache/hadoop/yarn/exceptions/YarnRuntimeException
	at java.net.URLClassLoader$1.run(URLClassLoader.java:366)
	at java.net.URLClassLoader$1.run(URLClassLoader.java:355)
	at java.security.AccessController.doPrivileged(Native Method)
	at java.net.URLClassLoader.findClass(URLClassLoader.java:354)
	at java.lang.ClassLoader.loadClass(ClassLoader.java:425)
	at sun.misc.Launcher$AppClassLoader.loadClass(Launcher.java:308)
	at java.lang.ClassLoader.loadClass(ClassLoader.java:358)
	at org.apache.hadoop.mapred.LocalDistributedCacheManager.setup(LocalDistributedCacheManager.java:93)
	at org.apache.hadoop.mapred.LocalJobRunner$Job.<init>(LocalJobRunner.java:164)
	at org.apache.hadoop.mapred.LocalJobRunner.submitJob(LocalJobRunner.java:759)
	at org.apache.hadoop.mapreduce.JobSubmitter.submitJobInternal(JobSubmitter.java:241)
	at org.apache.hadoop.mapreduce.Job$10.run(Job.java:1290)
	at org.apache.hadoop.mapreduce.Job$10.run(Job.java:1287)
	at java.security.AccessController.doPrivileged(Native Method)
	at javax.security.auth.Subject.doAs(Subject.java:415)
	at org.apache.hadoop.security.UserGroupInformation.doAs(UserGroupInformation.java:1666)
	at org.apache.hadoop.mapreduce.Job.submit(Job.java:1287)
	at org.apache.hadoop.mapred.JobClient$1.run(JobClient.java:575)
	at org.apache.hadoop.mapred.JobClient$1.run(JobClient.java:570)
	at java.security.AccessController.doPrivileged(Native Method)
	at javax.security.auth.Subject.doAs(Subject.java:415)
	at org.apache.hadoop.security.UserGroupInformation.doAs(UserGroupInformation.java:1666)
	at org.apache.hadoop.mapred.JobClient.submitJobInternal(JobClient.java:570)
	at org.apache.hadoop.mapred.JobClient.submitJob(JobClient.java:561)
	at org.apache.hadoop.mapred.JobClient.runJob(JobClient.java:864)
	at org.apache.hadoop.mapred.join.TestDatamerge.joinAs(TestDatamerge.java:245)
	at org.apache.hadoop.mapred.join.TestDatamerge.testSimpleOuterJoin(TestDatamerge.java:254)


FAILED:  org.apache.hadoop.mapred.join.TestDatamerge.testSimpleOverride

Error Message:
org/apache/hadoop/yarn/exceptions/YarnRuntimeException

Stack Trace:
java.lang.NoClassDefFoundError: org/apache/hadoop/yarn/exceptions/YarnRuntimeException
	at java.net.URLClassLoader$1.run(URLClassLoader.java:366)
	at java.net.URLClassLoader$1.run(URLClassLoader.java:355)
	at java.security.AccessController.doPrivileged(Native Method)
	at java.net.URLClassLoader.findClass(URLClassLoader.java:354)
	at java.lang.ClassLoader.loadClass(ClassLoader.java:425)
	at sun.misc.Launcher$AppClassLoader.loadClass(Launcher.java:308)
	at java.lang.ClassLoader.loadClass(ClassLoader.java:358)
	at org.apache.hadoop.mapred.LocalDistributedCacheManager.setup(LocalDistributedCacheManager.java:93)
	at org.apache.hadoop.mapred.LocalJobRunner$Job.<init>(LocalJobRunner.java:164)
	at org.apache.hadoop.mapred.LocalJobRunner.submitJob(LocalJobRunner.java:759)
	at org.apache.hadoop.mapreduce.JobSubmitter.submitJobInternal(JobSubmitter.java:241)
	at org.apache.hadoop.mapreduce.Job$10.run(Job.java:1290)
	at org.apache.hadoop.mapreduce.Job$10.run(Job.java:1287)
	at java.security.AccessController.doPrivileged(Native Method)
	at javax.security.auth.Subject.doAs(Subject.java:415)
	at org.apache.hadoop.security.UserGroupInformation.doAs(UserGroupInformation.java:1666)
	at org.apache.hadoop.mapreduce.Job.submit(Job.java:1287)
	at org.apache.hadoop.mapred.JobClient$1.run(JobClient.java:575)
	at org.apache.hadoop.mapred.JobClient$1.run(JobClient.java:570)
	at java.security.AccessController.doPrivileged(Native Method)
	at javax.security.auth.Subject.doAs(Subject.java:415)
	at org.apache.hadoop.security.UserGroupInformation.doAs(UserGroupInformation.java:1666)
	at org.apache.hadoop.mapred.JobClient.submitJobInternal(JobClient.java:570)
	at org.apache.hadoop.mapred.JobClient.submitJob(JobClient.java:561)
	at org.apache.hadoop.mapred.JobClient.runJob(JobClient.java:864)
	at org.apache.hadoop.mapred.join.TestDatamerge.joinAs(TestDatamerge.java:245)
	at org.apache.hadoop.mapred.join.TestDatamerge.testSimpleOverride(TestDatamerge.java:258)


FAILED:  org.apache.hadoop.mapred.join.TestDatamerge.testSimpleInnerJoin

Error Message:
org/apache/hadoop/yarn/exceptions/YarnRuntimeException

Stack Trace:
java.lang.NoClassDefFoundError: org/apache/hadoop/yarn/exceptions/YarnRuntimeException
	at java.net.URLClassLoader$1.run(URLClassLoader.java:366)
	at java.net.URLClassLoader$1.run(URLClassLoader.java:355)
	at java.security.AccessController.doPrivileged(Native Method)
	at java.net.URLClassLoader.findClass(URLClassLoader.java:354)
	at java.lang.ClassLoader.loadClass(ClassLoader.java:425)
	at sun.misc.Launcher$AppClassLoader.loadClass(Launcher.java:308)
	at java.lang.ClassLoader.loadClass(ClassLoader.java:358)
	at org.apache.hadoop.mapred.LocalDistributedCacheManager.setup(LocalDistributedCacheManager.java:93)
	at org.apache.hadoop.mapred.LocalJobRunner$Job.<init>(LocalJobRunner.java:164)
	at org.apache.hadoop.mapred.LocalJobRunner.submitJob(LocalJobRunner.java:759)
	at org.apache.hadoop.mapreduce.JobSubmitter.submitJobInternal(JobSubmitter.java:241)
	at org.apache.hadoop.mapreduce.Job$10.run(Job.java:1290)
	at org.apache.hadoop.mapreduce.Job$10.run(Job.java:1287)
	at java.security.AccessController.doPrivileged(Native Method)
	at javax.security.auth.Subject.doAs(Subject.java:415)
	at org.apache.hadoop.security.UserGroupInformation.doAs(UserGroupInformation.java:1666)
	at org.apache.hadoop.mapreduce.Job.submit(Job.java:1287)
	at org.apache.hadoop.mapred.JobClient$1.run(JobClient.java:575)
	at org.apache.hadoop.mapred.JobClient$1.run(JobClient.java:570)
	at java.security.AccessController.doPrivileged(Native Method)
	at javax.security.auth.Subject.doAs(Subject.java:415)
	at org.apache.hadoop.security.UserGroupInformation.doAs(UserGroupInformation.java:1666)
	at org.apache.hadoop.mapred.JobClient.submitJobInternal(JobClient.java:570)
	at org.apache.hadoop.mapred.JobClient.submitJob(JobClient.java:561)
	at org.apache.hadoop.mapred.JobClient.runJob(JobClient.java:864)
	at org.apache.hadoop.mapred.join.TestDatamerge.joinAs(TestDatamerge.java:245)
	at org.apache.hadoop.mapred.join.TestDatamerge.testSimpleInnerJoin(TestDatamerge.java:250)



Mime
  • Unnamed multipart/mixed (inline, None, 0 bytes)
View raw message