hadoop-yarn-dev mailing list archives

Site index · List index
Message view « Date » · « Thread »
Top « Date » · « Thread »
From Apache Jenkins Server <jenk...@builds.apache.org>
Subject Hadoop-Yarn-trunk-Java8 - Build # 208 - Failure
Date Tue, 26 May 2015 11:49:02 GMT
See https://builds.apache.org/job/Hadoop-Yarn-trunk-Java8/208/

###################################################################################
########################## LAST 60 LINES OF THE CONSOLE ###########################
[...truncated 5500 lines...]
Java HotSpot(TM) 64-Bit Server VM warning: ignoring option MaxPermSize=768m; support was removed
in 8.0
Running org.apache.hadoop.yarn.applications.distributedshell.TestDSAppMaster
Tests run: 2, Failures: 0, Errors: 0, Skipped: 0, Time elapsed: 1.558 sec - in org.apache.hadoop.yarn.applications.distributedshell.TestDSAppMaster
Java HotSpot(TM) 64-Bit Server VM warning: ignoring option MaxPermSize=768m; support was removed
in 8.0
Running org.apache.hadoop.yarn.applications.distributedshell.TestDistributedShell

Results :

Tests run: 3, Failures: 0, Errors: 0, Skipped: 0

[INFO] ------------------------------------------------------------------------
[INFO] Reactor Summary:
[INFO] 
[INFO] Apache Hadoop YARN ................................ SUCCESS [  3.018 s]
[INFO] Apache Hadoop YARN API ............................ SUCCESS [01:11 min]
[INFO] Apache Hadoop YARN Common ......................... SUCCESS [02:28 min]
[INFO] Apache Hadoop YARN Server ......................... SUCCESS [  0.049 s]
[INFO] Apache Hadoop YARN Server Common .................. SUCCESS [ 35.793 s]
[INFO] Apache Hadoop YARN NodeManager .................... SUCCESS [06:23 min]
[INFO] Apache Hadoop YARN Web Proxy ...................... SUCCESS [ 14.126 s]
[INFO] Apache Hadoop YARN ApplicationHistoryService ...... SUCCESS [03:03 min]
[INFO] Apache Hadoop YARN ResourceManager ................ SUCCESS [50:34 min]
[INFO] Apache Hadoop YARN Server Tests ................... SUCCESS [01:53 min]
[INFO] Apache Hadoop YARN Client ......................... SUCCESS [07:03 min]
[INFO] Apache Hadoop YARN SharedCacheManager ............. SUCCESS [ 19.188 s]
[INFO] Apache Hadoop YARN Applications ................... SUCCESS [  0.031 s]
[INFO] Apache Hadoop YARN DistributedShell ............... FAILURE [02:47 min]
[INFO] Apache Hadoop YARN Unmanaged Am Launcher .......... SKIPPED
[INFO] Apache Hadoop YARN Site ........................... SKIPPED
[INFO] Apache Hadoop YARN Registry ....................... SKIPPED
[INFO] Apache Hadoop YARN Project ........................ SKIPPED
[INFO] ------------------------------------------------------------------------
[INFO] BUILD FAILURE
[INFO] ------------------------------------------------------------------------
[INFO] Total time: 01:16 h
[INFO] Finished at: 2015-05-26T11:48:51+00:00
[INFO] Final Memory: 85M/1088M
[INFO] ------------------------------------------------------------------------
[ERROR] Failed to execute goal org.apache.maven.plugins:maven-surefire-plugin:2.17:test (default-test)
on project hadoop-yarn-applications-distributedshell: ExecutionException: java.lang.RuntimeException:
The forked VM terminated without properly saying goodbye. VM crash or System.exit called?
[ERROR] Command was /bin/sh -c cd /home/jenkins/jenkins-slave/workspace/Hadoop-Yarn-trunk-Java8/hadoop-yarn-project/hadoop-yarn/hadoop-yarn-applications/hadoop-yarn-applications-distributedshell
&& /home/jenkins/tools/java/jdk1.8.0/jre/bin/java -Xmx4096m -XX:MaxPermSize=768m -XX:+HeapDumpOnOutOfMemoryError
-jar /home/jenkins/jenkins-slave/workspace/Hadoop-Yarn-trunk-Java8/hadoop-yarn-project/hadoop-yarn/hadoop-yarn-applications/hadoop-yarn-applications-distributedshell/target/surefire/surefirebooter2220926848067844234.jar
/home/jenkins/jenkins-slave/workspace/Hadoop-Yarn-trunk-Java8/hadoop-yarn-project/hadoop-yarn/hadoop-yarn-applications/hadoop-yarn-applications-distributedshell/target/surefire/surefire1883550593129270011tmp
/home/jenkins/jenkins-slave/workspace/Hadoop-Yarn-trunk-Java8/hadoop-yarn-project/hadoop-yarn/hadoop-yarn-applications/hadoop-yarn-applications-distributedshell/target/surefire/surefire_3182029056918959204047tmp
[ERROR] -> [Help 1]
[ERROR] 
[ERROR] To see the full stack trace of the errors, re-run Maven with the -e switch.
[ERROR] Re-run Maven using the -X switch to enable full debug logging.
[ERROR] 
[ERROR] For more information about the errors and possible solutions, please read the following
articles:
[ERROR] [Help 1] http://cwiki.apache.org/confluence/display/MAVEN/MojoFailureException
[ERROR] 
[ERROR] After correcting the problems, you can resume the build with the command
[ERROR]   mvn <goals> -rf :hadoop-yarn-applications-distributedshell
Build step 'Execute shell' marked build as failure
Archiving artifacts
Recording test results
Updating YARN-2336
Updating HADOOP-8751
Updating YARN-2238
Sending e-mails to: yarn-dev@hadoop.apache.org
Email was triggered for: Failure
Sending email for trigger: Failure



###################################################################################
############################## FAILED TESTS (if any) ##############################
All tests passed
Mime
  • Unnamed multipart/mixed (inline, None, 0 bytes)
View raw message