hadoop-yarn-dev mailing list archives

Site index · List index
Message view « Date » · « Thread »
Top « Date » · « Thread »
From Apache Jenkins Server <jenk...@builds.apache.org>
Subject Failed: YARN-1012 PreCommit Build #8048
Date Thu, 21 May 2015 21:51:09 GMT
Jira: https://issues.apache.org/jira/browse/YARN-1012
Build: https://builds.apache.org/job/PreCommit-YARN-Build/8048/

###################################################################################
########################## LAST 60 LINES OF THE CONSOLE ###########################
[...truncated 326 lines...]
|      |                     |            | eclipse:eclipse.
|  +1  |           findbugs  |  3m 56s    | The patch does not introduce any 
|      |                     |            | new Findbugs (version 3.0.0)
|      |                     |            | warnings.
|  +1  |         yarn tests  |  0m 23s    | Tests passed in hadoop-yarn-api. 
|  -1  |         yarn tests  |  1m 55s    | Tests failed in hadoop-yarn-common. 
|  +1  |         yarn tests  |  6m 17s    | Tests passed in 
|      |                     |            | hadoop-yarn-server-nodemanager.
|      |                     |  50m 4s    | 


             Reason | Tests
 Failed unit tests  |  hadoop.yarn.api.TestPBImplRecords 


|| Subsystem || Report/Notes ||
============================================================================
| Patch URL | http://issues.apache.org/jira/secure/attachment/12734640/YARN-1012-5.patch |
| Optional Tests | javadoc javac unit findbugs checkstyle |
| git revision | trunk / 05e04f3 |
| hadoop-yarn-api test log | /home/jenkins/jenkins-slave/workspace/PreCommit-YARN-Build/patchprocess/testrun_hadoop-yarn-api.txt
|
| hadoop-yarn-common test log | /home/jenkins/jenkins-slave/workspace/PreCommit-YARN-Build/patchprocess/testrun_hadoop-yarn-common.txt
|
| hadoop-yarn-server-nodemanager test log | /home/jenkins/jenkins-slave/workspace/PreCommit-YARN-Build/patchprocess/testrun_hadoop-yarn-server-nodemanager.txt
|
| Test Results | https://builds.apache.org/job/PreCommit-YARN-Build/8048/testReport/ |
| Java | 1.7.0_55 |
| uname | Linux asf904.gq1.ygridcore.net 3.13.0-36-lowlatency #63-Ubuntu SMP PREEMPT Wed Sep
3 21:56:12 UTC 2014 x86_64 x86_64 x86_64 GNU/Linux |


============================================================================
============================================================================
                          Adding comment to JIRA
============================================================================
============================================================================


Comment added.
3c38cb8483881f50cfbeb48610558468860ea50c logged out


============================================================================
============================================================================
                              Finished build.
============================================================================
============================================================================


Build step 'Execute shell' marked build as failure
Archiving artifacts
Sending artifact delta relative to PreCommit-YARN-Build #8042
Archived 42 artifacts
Archive block size is 32768
Received 223 blocks and 22566309 bytes
Compression is 24.5%
Took 9 sec
[description-setter] Could not determine description.
Recording test results
Publish JUnit test result report is waiting for a checkpoint on PreCommit-YARN-Build #8047
Email was triggered for: Failure
Sending email for trigger: Failure



###################################################################################
############################## FAILED TESTS (if any) ##############################
1 tests failed.
FAILED:  org.apache.hadoop.yarn.api.TestPBImplRecords.testContainerStatusPBImpl

Error Message:
type class org.apache.hadoop.yarn.api.records.ResourceUtilization is not supported

Stack Trace:
java.lang.IllegalArgumentException: type class org.apache.hadoop.yarn.api.records.ResourceUtilization
is not supported
	at org.apache.hadoop.yarn.api.TestPBImplRecords.genTypeValue(TestPBImplRecords.java:396)
	at org.apache.hadoop.yarn.api.TestPBImplRecords.getGetSetPairs(TestPBImplRecords.java:573)
	at org.apache.hadoop.yarn.api.TestPBImplRecords.validatePBImplRecord(TestPBImplRecords.java:588)
	at org.apache.hadoop.yarn.api.TestPBImplRecords.testContainerStatusPBImpl(TestPBImplRecords.java:977)



Mime
  • Unnamed multipart/mixed (inline, None, 0 bytes)
View raw message