hadoop-yarn-dev mailing list archives

Site index · List index
Message view « Date » · « Thread »
Top « Date » · « Thread »
From Apache Jenkins Server <jenk...@builds.apache.org>
Subject Failed: YARN-3543 PreCommit Build #7732
Date Wed, 06 May 2015 13:43:27 GMT
Jira: https://issues.apache.org/jira/browse/YARN-3543
Build: https://builds.apache.org/job/PreCommit-YARN-Build/7732/

###################################################################################
########################## LAST 60 LINES OF THE CONSOLE ###########################
[...truncated 439 lines...]
|  +1  |         yarn tests  |  0m 24s    | Tests passed in 
|      |                     |            | hadoop-yarn-server-common.
|  -1  |         yarn tests  |  55m 28s   | Tests failed in 
|      |                     |            | hadoop-yarn-server-resourcemanager.
|      |                     |  115m 39s  | 


             Reason | Tests
 Failed unit tests  |  hadoop.yarn.server.resourcemanager.ahs.TestRMApplicationHistoryWriter



|| Subsystem || Report/Notes ||
============================================================================
| Patch URL | http://issues.apache.org/jira/secure/attachment/12730793/0002-YARN-3543.patch
|
| Optional Tests | javadoc javac unit findbugs checkstyle |
| git revision | trunk / a583a40 |
| checkstyle |  /home/jenkins/jenkins-slave/workspace/PreCommit-YARN-Build/patchprocess/diffcheckstylehadoop-yarn-api.txt
|
| whitespace | /home/jenkins/jenkins-slave/workspace/PreCommit-YARN-Build/patchprocess/whitespace.txt
|
| hadoop-yarn-api test log | /home/jenkins/jenkins-slave/workspace/PreCommit-YARN-Build/patchprocess/testrun_hadoop-yarn-api.txt
|
| hadoop-yarn-client test log | /home/jenkins/jenkins-slave/workspace/PreCommit-YARN-Build/patchprocess/testrun_hadoop-yarn-client.txt
|
| hadoop-yarn-common test log | /home/jenkins/jenkins-slave/workspace/PreCommit-YARN-Build/patchprocess/testrun_hadoop-yarn-common.txt
|
| hadoop-yarn-server-applicationhistoryservice test log | /home/jenkins/jenkins-slave/workspace/PreCommit-YARN-Build/patchprocess/testrun_hadoop-yarn-server-applicationhistoryservice.txt
|
| hadoop-yarn-server-common test log | /home/jenkins/jenkins-slave/workspace/PreCommit-YARN-Build/patchprocess/testrun_hadoop-yarn-server-common.txt
|
| hadoop-yarn-server-resourcemanager test log | /home/jenkins/jenkins-slave/workspace/PreCommit-YARN-Build/patchprocess/testrun_hadoop-yarn-server-resourcemanager.txt
|
| Test Results | https://builds.apache.org/job/PreCommit-YARN-Build/7732/testReport/ |
| Java | 1.7.0_55 |
| uname | Linux asf903.gq1.ygridcore.net 3.13.0-36-lowlatency #63-Ubuntu SMP PREEMPT Wed Sep
3 21:56:12 UTC 2014 x86_64 x86_64 x86_64 GNU/Linux |


============================================================================
============================================================================
                          Adding comment to JIRA
============================================================================
============================================================================


Comment added.
95a64ace07ce0066532eb3e83df975589c699986 logged out


============================================================================
============================================================================
                              Finished build.
============================================================================
============================================================================


Build step 'Execute shell' marked build as failure
Archiving artifacts
Sending artifact delta relative to PreCommit-YARN-Build #7730
Archived 70 artifacts
Archive block size is 32768
Received 65 blocks and 30481153 bytes
Compression is 6.5%
Took 10 sec
[description-setter] Could not determine description.
Recording test results
Email was triggered for: Failure
Sending email for trigger: Failure



###################################################################################
############################## FAILED TESTS (if any) ##############################
2 tests failed.
REGRESSION:  org.apache.hadoop.yarn.server.resourcemanager.ahs.TestRMApplicationHistoryWriter.testParallelWrite

Error Message:
null

Stack Trace:
java.lang.NullPointerException: null
	at org.apache.hadoop.yarn.server.resourcemanager.ahs.RMApplicationHistoryWriter.applicationStarted(RMApplicationHistoryWriter.java:227)
	at org.apache.hadoop.yarn.server.resourcemanager.ahs.TestRMApplicationHistoryWriter.testParallelWrite(TestRMApplicationHistoryWriter.java:333)


REGRESSION:  org.apache.hadoop.yarn.server.resourcemanager.ahs.TestRMApplicationHistoryWriter.testWriteApplication

Error Message:
null

Stack Trace:
java.lang.NullPointerException: null
	at org.apache.hadoop.yarn.server.resourcemanager.ahs.RMApplicationHistoryWriter.applicationStarted(RMApplicationHistoryWriter.java:227)
	at org.apache.hadoop.yarn.server.resourcemanager.ahs.TestRMApplicationHistoryWriter.testWriteApplication(TestRMApplicationHistoryWriter.java:202)



Mime
  • Unnamed multipart/mixed (inline, None, 0 bytes)
View raw message