hadoop-yarn-dev mailing list archives

Site index · List index
Message view « Date » · « Thread »
Top « Date » · « Thread »
From Apache Jenkins Server <jenk...@builds.apache.org>
Subject Build failed in Jenkins: Hadoop-Yarn-trunk-Java8 #194
Date Tue, 12 May 2015 12:17:01 GMT
See <https://builds.apache.org/job/Hadoop-Yarn-trunk-Java8/194/changes>

Changes:

[junping_du] YARN-3587. Fix the javadoc of DelegationTokenSecretManager in yarn, etc. projects.
Contributed by Gabor Liptak.

[aajisaka] HDFS-8241. Remove unused NameNode startup option -finalize. Contributed by Brahma
Reddy Battula.

[aajisaka] HADOOP-11663. Remove description about Java 6 from docs. Contributed by Masatake
Iwasaki.

[aw] HADOOP-11928. Test-patch check for @author tags incorrectly flags removal of @author
tags (Kengo Seki via aw)

[aw] HADOOP-11951. test-patch should give better info about failures to handle dev-support
updates without resetrepo option (Sean Busbey via aw)

[aw] HADOOP-11950. Add cli option to test-patch to set the project-under-test (Sean Busbey
via aw)

[aw] HADOOP-11948. test-patch's issue matching regex should be configurable. (Sean Busbey
via aw)

[aw] HADOOP-11947. test-patch should return early from determine-issue when run in jenkins
mode. (Sean Busbey via aw)

[aw] re-commit of HADOOP-11881

[kihwal] HDFS-7916. 'reportBadBlocks' from datanodes to standby Node BPServiceActor goes for
infinite loop. Contributed by Rushabh Shah.

[wangda] Moved YARN-3434. (Interaction between reservations and userlimit can result in significant
ULF violation.) From 2.8.0 to 2.7.1

[jlowe] MAPREDUCE-5465. Tasks are often killed before they exit on their own. Contributed
by Ming Ma

[wangda] YARN-3489. RMServerUtils.validateResourceRequests should only obtain queue info once.
(Varun Saxena via wangda)

[wangda] Move YARN-3493 in CHANGES.txt from 2.8 to 2.7.1

[vinayakumarb] HDFS-8362. Java Compilation Error in TestHdfsConfigFields.java (Contributed
by Arshad Mohammad)

[vinayakumarb] MAPREDUCE-6360. TestMapreduceConfigFields is placed in wrong dir, introducing
compile error (Contributed by Arshad Mohammad)

------------------------------------------
[...truncated 4883 lines...]
Tests run: 9, Failures: 0, Errors: 0, Skipped: 0, Time elapsed: 3.392 sec - in org.apache.hadoop.yarn.server.resourcemanager.scheduler.capacity.TestReservations
Java HotSpot(TM) 64-Bit Server VM warning: ignoring option MaxPermSize=768m; support was removed
in 8.0
Running org.apache.hadoop.yarn.server.resourcemanager.scheduler.capacity.TestChildQueueOrder
Tests run: 1, Failures: 0, Errors: 0, Skipped: 0, Time elapsed: 2.049 sec - in org.apache.hadoop.yarn.server.resourcemanager.scheduler.capacity.TestChildQueueOrder
Java HotSpot(TM) 64-Bit Server VM warning: ignoring option MaxPermSize=768m; support was removed
in 8.0
Running org.apache.hadoop.yarn.server.resourcemanager.scheduler.TestSchedulerApplicationAttempt
Tests run: 1, Failures: 0, Errors: 0, Skipped: 0, Time elapsed: 0.806 sec - in org.apache.hadoop.yarn.server.resourcemanager.scheduler.TestSchedulerApplicationAttempt
Java HotSpot(TM) 64-Bit Server VM warning: ignoring option MaxPermSize=768m; support was removed
in 8.0
Running org.apache.hadoop.yarn.server.resourcemanager.scheduler.TestQueueMetrics
Tests run: 7, Failures: 0, Errors: 0, Skipped: 0, Time elapsed: 2.265 sec - in org.apache.hadoop.yarn.server.resourcemanager.scheduler.TestQueueMetrics
Java HotSpot(TM) 64-Bit Server VM warning: ignoring option MaxPermSize=768m; support was removed
in 8.0
Running org.apache.hadoop.yarn.server.resourcemanager.scheduler.policy.TestFifoOrderingPolicy
Tests run: 2, Failures: 0, Errors: 0, Skipped: 0, Time elapsed: 0.461 sec - in org.apache.hadoop.yarn.server.resourcemanager.scheduler.policy.TestFifoOrderingPolicy
Java HotSpot(TM) 64-Bit Server VM warning: ignoring option MaxPermSize=768m; support was removed
in 8.0
Running org.apache.hadoop.yarn.server.resourcemanager.scheduler.policy.TestFairOrderingPolicy
Tests run: 3, Failures: 0, Errors: 0, Skipped: 0, Time elapsed: 0.443 sec - in org.apache.hadoop.yarn.server.resourcemanager.scheduler.policy.TestFairOrderingPolicy
Java HotSpot(TM) 64-Bit Server VM warning: ignoring option MaxPermSize=768m; support was removed
in 8.0
Running org.apache.hadoop.yarn.server.resourcemanager.scheduler.fifo.TestFifoScheduler
Tests run: 16, Failures: 0, Errors: 0, Skipped: 0, Time elapsed: 31.815 sec - in org.apache.hadoop.yarn.server.resourcemanager.scheduler.fifo.TestFifoScheduler
Java HotSpot(TM) 64-Bit Server VM warning: ignoring option MaxPermSize=768m; support was removed
in 8.0
Running org.apache.hadoop.yarn.server.resourcemanager.security.TestAMRMTokens
Tests run: 6, Failures: 0, Errors: 0, Skipped: 0, Time elapsed: 59.724 sec - in org.apache.hadoop.yarn.server.resourcemanager.security.TestAMRMTokens
Java HotSpot(TM) 64-Bit Server VM warning: ignoring option MaxPermSize=768m; support was removed
in 8.0
Running org.apache.hadoop.yarn.server.resourcemanager.security.TestRMDelegationTokens
Tests run: 2, Failures: 0, Errors: 0, Skipped: 0, Time elapsed: 5.57 sec - in org.apache.hadoop.yarn.server.resourcemanager.security.TestRMDelegationTokens
Java HotSpot(TM) 64-Bit Server VM warning: ignoring option MaxPermSize=768m; support was removed
in 8.0
Running org.apache.hadoop.yarn.server.resourcemanager.security.TestDelegationTokenRenewerLifecycle
Tests run: 1, Failures: 0, Errors: 0, Skipped: 0, Time elapsed: 0.68 sec - in org.apache.hadoop.yarn.server.resourcemanager.security.TestDelegationTokenRenewerLifecycle
Java HotSpot(TM) 64-Bit Server VM warning: ignoring option MaxPermSize=768m; support was removed
in 8.0
Running org.apache.hadoop.yarn.server.resourcemanager.security.TestDelegationTokenRenewer
Tests run: 14, Failures: 0, Errors: 0, Skipped: 0, Time elapsed: 79.697 sec - in org.apache.hadoop.yarn.server.resourcemanager.security.TestDelegationTokenRenewer
Java HotSpot(TM) 64-Bit Server VM warning: ignoring option MaxPermSize=768m; support was removed
in 8.0
Running org.apache.hadoop.yarn.server.resourcemanager.security.TestClientToAMTokens
Tests run: 4, Failures: 0, Errors: 0, Skipped: 0, Time elapsed: 15.459 sec - in org.apache.hadoop.yarn.server.resourcemanager.security.TestClientToAMTokens
Java HotSpot(TM) 64-Bit Server VM warning: ignoring option MaxPermSize=768m; support was removed
in 8.0
Running org.apache.hadoop.yarn.server.resourcemanager.TestSubmitApplicationWithRMHA
Tests run: 6, Failures: 0, Errors: 0, Skipped: 0, Time elapsed: 10.907 sec - in org.apache.hadoop.yarn.server.resourcemanager.TestSubmitApplicationWithRMHA
Java HotSpot(TM) 64-Bit Server VM warning: ignoring option MaxPermSize=768m; support was removed
in 8.0
Running org.apache.hadoop.yarn.server.resourcemanager.TestResourceManager
Tests run: 5, Failures: 0, Errors: 0, Skipped: 0, Time elapsed: 3.342 sec - in org.apache.hadoop.yarn.server.resourcemanager.TestResourceManager
Java HotSpot(TM) 64-Bit Server VM warning: ignoring option MaxPermSize=768m; support was removed
in 8.0
Running org.apache.hadoop.yarn.server.resourcemanager.TestMoveApplication
Tests run: 4, Failures: 0, Errors: 0, Skipped: 0, Time elapsed: 4.051 sec - in org.apache.hadoop.yarn.server.resourcemanager.TestMoveApplication
Java HotSpot(TM) 64-Bit Server VM warning: ignoring option MaxPermSize=768m; support was removed
in 8.0
Running org.apache.hadoop.yarn.server.resourcemanager.TestApplicationACLs
Tests run: 1, Failures: 0, Errors: 0, Skipped: 0, Time elapsed: 19.62 sec - in org.apache.hadoop.yarn.server.resourcemanager.TestApplicationACLs
Java HotSpot(TM) 64-Bit Server VM warning: ignoring option MaxPermSize=768m; support was removed
in 8.0
Running org.apache.hadoop.yarn.server.resourcemanager.metrics.TestSystemMetricsPublisher
Tests run: 3, Failures: 0, Errors: 0, Skipped: 0, Time elapsed: 5.017 sec - in org.apache.hadoop.yarn.server.resourcemanager.metrics.TestSystemMetricsPublisher
Java HotSpot(TM) 64-Bit Server VM warning: ignoring option MaxPermSize=768m; support was removed
in 8.0
Running org.apache.hadoop.yarn.server.resourcemanager.TestApplicationMasterLauncher
Tests run: 3, Failures: 0, Errors: 0, Skipped: 0, Time elapsed: 13.003 sec - in org.apache.hadoop.yarn.server.resourcemanager.TestApplicationMasterLauncher
Java HotSpot(TM) 64-Bit Server VM warning: ignoring option MaxPermSize=768m; support was removed
in 8.0
Running org.apache.hadoop.yarn.server.resourcemanager.TestClientRMService
Tests run: 24, Failures: 0, Errors: 0, Skipped: 0, Time elapsed: 10.587 sec - in org.apache.hadoop.yarn.server.resourcemanager.TestClientRMService
Java HotSpot(TM) 64-Bit Server VM warning: ignoring option MaxPermSize=768m; support was removed
in 8.0
Running org.apache.hadoop.yarn.server.resourcemanager.TestClusterMetrics
Tests run: 1, Failures: 0, Errors: 0, Skipped: 0, Time elapsed: 0.379 sec - in org.apache.hadoop.yarn.server.resourcemanager.TestClusterMetrics
Java HotSpot(TM) 64-Bit Server VM warning: ignoring option MaxPermSize=768m; support was removed
in 8.0
Running org.apache.hadoop.yarn.server.resourcemanager.TestRMAuditLogger
Tests run: 3, Failures: 0, Errors: 0, Skipped: 0, Time elapsed: 1 sec - in org.apache.hadoop.yarn.server.resourcemanager.TestRMAuditLogger
Java HotSpot(TM) 64-Bit Server VM warning: ignoring option MaxPermSize=768m; support was removed
in 8.0
Running org.apache.hadoop.yarn.server.resourcemanager.logaggregationstatus.TestRMAppLogAggregationStatus
Tests run: 2, Failures: 0, Errors: 0, Skipped: 0, Time elapsed: 2.628 sec - in org.apache.hadoop.yarn.server.resourcemanager.logaggregationstatus.TestRMAppLogAggregationStatus
Java HotSpot(TM) 64-Bit Server VM warning: ignoring option MaxPermSize=768m; support was removed
in 8.0
Running org.apache.hadoop.yarn.server.resourcemanager.reservation.TestCapacitySchedulerPlanFollower
Tests run: 2, Failures: 0, Errors: 0, Skipped: 0, Time elapsed: 1.899 sec - in org.apache.hadoop.yarn.server.resourcemanager.reservation.TestCapacitySchedulerPlanFollower
Java HotSpot(TM) 64-Bit Server VM warning: ignoring option MaxPermSize=768m; support was removed
in 8.0
Running org.apache.hadoop.yarn.server.resourcemanager.reservation.TestNoOverCommitPolicy
Tests run: 6, Failures: 0, Errors: 0, Skipped: 0, Time elapsed: 1.155 sec - in org.apache.hadoop.yarn.server.resourcemanager.reservation.TestNoOverCommitPolicy
Java HotSpot(TM) 64-Bit Server VM warning: ignoring option MaxPermSize=768m; support was removed
in 8.0
Running org.apache.hadoop.yarn.server.resourcemanager.reservation.TestCapacityOverTimePolicy
Tests run: 8, Failures: 0, Errors: 0, Skipped: 0, Time elapsed: 2.714 sec - in org.apache.hadoop.yarn.server.resourcemanager.reservation.TestCapacityOverTimePolicy
Java HotSpot(TM) 64-Bit Server VM warning: ignoring option MaxPermSize=768m; support was removed
in 8.0
Running org.apache.hadoop.yarn.server.resourcemanager.reservation.TestRLESparseResourceAllocation
Tests run: 4, Failures: 0, Errors: 0, Skipped: 0, Time elapsed: 0.446 sec - in org.apache.hadoop.yarn.server.resourcemanager.reservation.TestRLESparseResourceAllocation
Java HotSpot(TM) 64-Bit Server VM warning: ignoring option MaxPermSize=768m; support was removed
in 8.0
Running org.apache.hadoop.yarn.server.resourcemanager.reservation.TestFairReservationSystem
Tests run: 2, Failures: 0, Errors: 0, Skipped: 0, Time elapsed: 1.373 sec - in org.apache.hadoop.yarn.server.resourcemanager.reservation.TestFairReservationSystem
Java HotSpot(TM) 64-Bit Server VM warning: ignoring option MaxPermSize=768m; support was removed
in 8.0
Running org.apache.hadoop.yarn.server.resourcemanager.reservation.TestSimpleCapacityReplanner
Tests run: 1, Failures: 0, Errors: 0, Skipped: 0, Time elapsed: 0.731 sec - in org.apache.hadoop.yarn.server.resourcemanager.reservation.TestSimpleCapacityReplanner
Java HotSpot(TM) 64-Bit Server VM warning: ignoring option MaxPermSize=768m; support was removed
in 8.0
Running org.apache.hadoop.yarn.server.resourcemanager.reservation.TestReservationInputValidator
Tests run: 23, Failures: 0, Errors: 0, Skipped: 0, Time elapsed: 0.766 sec - in org.apache.hadoop.yarn.server.resourcemanager.reservation.TestReservationInputValidator
Java HotSpot(TM) 64-Bit Server VM warning: ignoring option MaxPermSize=768m; support was removed
in 8.0
Running org.apache.hadoop.yarn.server.resourcemanager.reservation.TestInMemoryReservationAllocation
Tests run: 5, Failures: 0, Errors: 0, Skipped: 0, Time elapsed: 0.49 sec - in org.apache.hadoop.yarn.server.resourcemanager.reservation.TestInMemoryReservationAllocation
Java HotSpot(TM) 64-Bit Server VM warning: ignoring option MaxPermSize=768m; support was removed
in 8.0
Running org.apache.hadoop.yarn.server.resourcemanager.reservation.TestCapacityReservationSystem
Tests run: 2, Failures: 0, Errors: 0, Skipped: 0, Time elapsed: 1.643 sec - in org.apache.hadoop.yarn.server.resourcemanager.reservation.TestCapacityReservationSystem
Java HotSpot(TM) 64-Bit Server VM warning: ignoring option MaxPermSize=768m; support was removed
in 8.0
Running org.apache.hadoop.yarn.server.resourcemanager.reservation.TestInMemoryPlan
Tests run: 8, Failures: 0, Errors: 0, Skipped: 0, Time elapsed: 0.749 sec - in org.apache.hadoop.yarn.server.resourcemanager.reservation.TestInMemoryPlan
Java HotSpot(TM) 64-Bit Server VM warning: ignoring option MaxPermSize=768m; support was removed
in 8.0
Running org.apache.hadoop.yarn.server.resourcemanager.reservation.TestFairSchedulerPlanFollower
Tests run: 2, Failures: 0, Errors: 0, Skipped: 0, Time elapsed: 1.683 sec - in org.apache.hadoop.yarn.server.resourcemanager.reservation.TestFairSchedulerPlanFollower
Java HotSpot(TM) 64-Bit Server VM warning: ignoring option MaxPermSize=768m; support was removed
in 8.0
Running org.apache.hadoop.yarn.server.resourcemanager.reservation.TestGreedyReservationAgent
Tests run: 9, Failures: 0, Errors: 0, Skipped: 0, Time elapsed: 0.949 sec - in org.apache.hadoop.yarn.server.resourcemanager.reservation.TestGreedyReservationAgent
Java HotSpot(TM) 64-Bit Server VM warning: ignoring option MaxPermSize=768m; support was removed
in 8.0
Running org.apache.hadoop.yarn.server.resourcemanager.TestApplicationCleanup
Tests run: 7, Failures: 0, Errors: 0, Skipped: 0, Time elapsed: 51.407 sec - in org.apache.hadoop.yarn.server.resourcemanager.TestApplicationCleanup
Java HotSpot(TM) 64-Bit Server VM warning: ignoring option MaxPermSize=768m; support was removed
in 8.0
Running org.apache.hadoop.yarn.server.resourcemanager.TestContainerResourceUsage
Tests run: 4, Failures: 0, Errors: 0, Skipped: 0, Time elapsed: 38.147 sec - in org.apache.hadoop.yarn.server.resourcemanager.TestContainerResourceUsage
Java HotSpot(TM) 64-Bit Server VM warning: ignoring option MaxPermSize=768m; support was removed
in 8.0
Running org.apache.hadoop.yarn.server.resourcemanager.ahs.TestRMApplicationHistoryWriter
Tests run: 7, Failures: 0, Errors: 0, Skipped: 0, Time elapsed: 157.36 sec - in org.apache.hadoop.yarn.server.resourcemanager.ahs.TestRMApplicationHistoryWriter
Java HotSpot(TM) 64-Bit Server VM warning: ignoring option MaxPermSize=768m; support was removed
in 8.0
Running org.apache.hadoop.yarn.server.resourcemanager.TestRM
Tests run: 22, Failures: 0, Errors: 0, Skipped: 0, Time elapsed: 166.23 sec - in org.apache.hadoop.yarn.server.resourcemanager.TestRM
Java HotSpot(TM) 64-Bit Server VM warning: ignoring option MaxPermSize=768m; support was removed
in 8.0
Running org.apache.hadoop.yarn.server.resourcemanager.TestAppManager
Tests run: 14, Failures: 0, Errors: 0, Skipped: 0, Time elapsed: 5.923 sec - in org.apache.hadoop.yarn.server.resourcemanager.TestAppManager
Java HotSpot(TM) 64-Bit Server VM warning: ignoring option MaxPermSize=768m; support was removed
in 8.0
Running org.apache.hadoop.yarn.server.resourcemanager.rmcontainer.TestRMContainerImpl
Tests run: 3, Failures: 0, Errors: 0, Skipped: 0, Time elapsed: 6.621 sec - in org.apache.hadoop.yarn.server.resourcemanager.rmcontainer.TestRMContainerImpl
Java HotSpot(TM) 64-Bit Server VM warning: ignoring option MaxPermSize=768m; support was removed
in 8.0
Running org.apache.hadoop.yarn.server.resourcemanager.TestClientRMTokens
Tests run: 6, Failures: 0, Errors: 0, Skipped: 0, Time elapsed: 17.398 sec - in org.apache.hadoop.yarn.server.resourcemanager.TestClientRMTokens
Java HotSpot(TM) 64-Bit Server VM warning: ignoring option MaxPermSize=768m; support was removed
in 8.0
Running org.apache.hadoop.yarn.server.resourcemanager.TestRMAdminService
Tests run: 18, Failures: 0, Errors: 0, Skipped: 0, Time elapsed: 9.039 sec - in org.apache.hadoop.yarn.server.resourcemanager.TestRMAdminService
Java HotSpot(TM) 64-Bit Server VM warning: ignoring option MaxPermSize=768m; support was removed
in 8.0
Running org.apache.hadoop.yarn.server.resourcemanager.TestAMAuthorization
Tests run: 4, Failures: 0, Errors: 0, Skipped: 0, Time elapsed: 14.485 sec - in org.apache.hadoop.yarn.server.resourcemanager.TestAMAuthorization
Java HotSpot(TM) 64-Bit Server VM warning: ignoring option MaxPermSize=768m; support was removed
in 8.0
Running org.apache.hadoop.yarn.server.resourcemanager.TestApplicationMasterService
Tests run: 5, Failures: 0, Errors: 0, Skipped: 0, Time elapsed: 41.753 sec - in org.apache.hadoop.yarn.server.resourcemanager.TestApplicationMasterService
Java HotSpot(TM) 64-Bit Server VM warning: ignoring option MaxPermSize=768m; support was removed
in 8.0
Running org.apache.hadoop.yarn.server.resourcemanager.monitor.capacity.TestProportionalCapacityPreemptionPolicy
Tests run: 25, Failures: 0, Errors: 0, Skipped: 0, Time elapsed: 14.148 sec - in org.apache.hadoop.yarn.server.resourcemanager.monitor.capacity.TestProportionalCapacityPreemptionPolicy
Java HotSpot(TM) 64-Bit Server VM warning: ignoring option MaxPermSize=768m; support was removed
in 8.0
Running org.apache.hadoop.yarn.server.resourcemanager.monitor.capacity.TestProportionalCapacityPreemptionPolicyForNodePartitions
Tests run: 10, Failures: 0, Errors: 0, Skipped: 0, Time elapsed: 4.703 sec - in org.apache.hadoop.yarn.server.resourcemanager.monitor.capacity.TestProportionalCapacityPreemptionPolicyForNodePartitions
Java HotSpot(TM) 64-Bit Server VM warning: ignoring option MaxPermSize=768m; support was removed
in 8.0
Running org.apache.hadoop.yarn.server.resourcemanager.monitor.TestSchedulingMonitor
Tests run: 1, Failures: 0, Errors: 0, Skipped: 0, Time elapsed: 1.331 sec - in org.apache.hadoop.yarn.server.resourcemanager.monitor.TestSchedulingMonitor
Java HotSpot(TM) 64-Bit Server VM warning: ignoring option MaxPermSize=768m; support was removed
in 8.0
Running org.apache.hadoop.yarn.server.resourcemanager.TestKillApplicationWithRMHA
Tests run: 4, Failures: 0, Errors: 0, Skipped: 0, Time elapsed: 25.639 sec - in org.apache.hadoop.yarn.server.resourcemanager.TestKillApplicationWithRMHA
Java HotSpot(TM) 64-Bit Server VM warning: ignoring option MaxPermSize=768m; support was removed
in 8.0
Running org.apache.hadoop.yarn.server.resourcemanager.webapp.TestRMWebServicesApps
Tests run: 40, Failures: 0, Errors: 0, Skipped: 0, Time elapsed: 168.564 sec - in org.apache.hadoop.yarn.server.resourcemanager.webapp.TestRMWebServicesApps
Java HotSpot(TM) 64-Bit Server VM warning: ignoring option MaxPermSize=768m; support was removed
in 8.0
Running org.apache.hadoop.yarn.server.resourcemanager.webapp.TestRMWebappAuthentication
Tests run: 2, Failures: 0, Errors: 0, Skipped: 0, Time elapsed: 8.605 sec - in org.apache.hadoop.yarn.server.resourcemanager.webapp.TestRMWebappAuthentication
Java HotSpot(TM) 64-Bit Server VM warning: ignoring option MaxPermSize=768m; support was removed
in 8.0
Running org.apache.hadoop.yarn.server.resourcemanager.webapp.TestRMWebServicesDelegationTokens
Tests run: 6, Failures: 0, Errors: 0, Skipped: 0, Time elapsed: 43.296 sec - in org.apache.hadoop.yarn.server.resourcemanager.webapp.TestRMWebServicesDelegationTokens
Java HotSpot(TM) 64-Bit Server VM warning: ignoring option MaxPermSize=768m; support was removed
in 8.0
Running org.apache.hadoop.yarn.server.resourcemanager.webapp.TestAppPage
Tests run: 1, Failures: 0, Errors: 0, Skipped: 0, Time elapsed: 1.871 sec - in org.apache.hadoop.yarn.server.resourcemanager.webapp.TestAppPage
Java HotSpot(TM) 64-Bit Server VM warning: ignoring option MaxPermSize=768m; support was removed
in 8.0
Running org.apache.hadoop.yarn.server.resourcemanager.webapp.TestRMWebApp
Tests run: 3, Failures: 0, Errors: 0, Skipped: 0, Time elapsed: 9.771 sec - in org.apache.hadoop.yarn.server.resourcemanager.webapp.TestRMWebApp
Java HotSpot(TM) 64-Bit Server VM warning: ignoring option MaxPermSize=768m; support was removed
in 8.0
Running org.apache.hadoop.yarn.server.resourcemanager.webapp.TestRMWebServicesCapacitySched
Tests run: 7, Failures: 0, Errors: 0, Skipped: 0, Time elapsed: 14.631 sec - in org.apache.hadoop.yarn.server.resourcemanager.webapp.TestRMWebServicesCapacitySched
Java HotSpot(TM) 64-Bit Server VM warning: ignoring option MaxPermSize=768m; support was removed
in 8.0
Running org.apache.hadoop.yarn.server.resourcemanager.webapp.TestRMWebServicesDelegationTokenAuthentication
Tests run: 8, Failures: 0, Errors: 0, Skipped: 0, Time elapsed: 8.352 sec - in org.apache.hadoop.yarn.server.resourcemanager.webapp.TestRMWebServicesDelegationTokenAuthentication
Java HotSpot(TM) 64-Bit Server VM warning: ignoring option MaxPermSize=768m; support was removed
in 8.0
Running org.apache.hadoop.yarn.server.resourcemanager.webapp.TestRMWebServicesNodes
Tests run: 22, Failures: 0, Errors: 0, Skipped: 0, Time elapsed: 11.422 sec - in org.apache.hadoop.yarn.server.resourcemanager.webapp.TestRMWebServicesNodes
Java HotSpot(TM) 64-Bit Server VM warning: ignoring option MaxPermSize=768m; support was removed
in 8.0
Running org.apache.hadoop.yarn.server.resourcemanager.webapp.TestRMWebServices
Tests run: 20, Failures: 0, Errors: 0, Skipped: 0, Time elapsed: 12.582 sec - in org.apache.hadoop.yarn.server.resourcemanager.webapp.TestRMWebServices
Java HotSpot(TM) 64-Bit Server VM warning: ignoring option MaxPermSize=768m; support was removed
in 8.0
Running org.apache.hadoop.yarn.server.resourcemanager.webapp.TestRMWebServicesHttpStaticUserPermissions
Tests run: 1, Failures: 0, Errors: 0, Skipped: 0, Time elapsed: 7.057 sec - in org.apache.hadoop.yarn.server.resourcemanager.webapp.TestRMWebServicesHttpStaticUserPermissions
Java HotSpot(TM) 64-Bit Server VM warning: ignoring option MaxPermSize=768m; support was removed
in 8.0
Running org.apache.hadoop.yarn.server.resourcemanager.webapp.TestRMWebAppFairScheduler
Tests run: 2, Failures: 0, Errors: 0, Skipped: 0, Time elapsed: 4.825 sec - in org.apache.hadoop.yarn.server.resourcemanager.webapp.TestRMWebAppFairScheduler
Java HotSpot(TM) 64-Bit Server VM warning: ignoring option MaxPermSize=768m; support was removed
in 8.0
Running org.apache.hadoop.yarn.server.resourcemanager.webapp.TestRMWebServicesAppsModification
Tests run: 40, Failures: 0, Errors: 0, Skipped: 0, Time elapsed: 218.61 sec - in org.apache.hadoop.yarn.server.resourcemanager.webapp.TestRMWebServicesAppsModification
Java HotSpot(TM) 64-Bit Server VM warning: ignoring option MaxPermSize=768m; support was removed
in 8.0
Running org.apache.hadoop.yarn.server.resourcemanager.webapp.TestRMWebServicesNodeLabels
Tests run: 1, Failures: 0, Errors: 0, Skipped: 0, Time elapsed: 3.978 sec - in org.apache.hadoop.yarn.server.resourcemanager.webapp.TestRMWebServicesNodeLabels
Java HotSpot(TM) 64-Bit Server VM warning: ignoring option MaxPermSize=768m; support was removed
in 8.0
Running org.apache.hadoop.yarn.server.resourcemanager.webapp.TestNodesPage
Tests run: 5, Failures: 0, Errors: 0, Skipped: 0, Time elapsed: 5.908 sec - in org.apache.hadoop.yarn.server.resourcemanager.webapp.TestNodesPage
Java HotSpot(TM) 64-Bit Server VM warning: ignoring option MaxPermSize=768m; support was removed
in 8.0
Running org.apache.hadoop.yarn.server.resourcemanager.webapp.TestRMWebServicesFairScheduler
Tests run: 2, Failures: 0, Errors: 0, Skipped: 0, Time elapsed: 3.845 sec - in org.apache.hadoop.yarn.server.resourcemanager.webapp.TestRMWebServicesFairScheduler

Results :

Tests run: 1082, Failures: 0, Errors: 0, Skipped: 1

[INFO] ------------------------------------------------------------------------
[INFO] Reactor Summary:
[INFO] 
[INFO] Apache Hadoop YARN ................................ SUCCESS [  3.201 s]
[INFO] Apache Hadoop YARN API ............................ SUCCESS [01:11 min]
[INFO] Apache Hadoop YARN Common ......................... SUCCESS [02:24 min]
[INFO] Apache Hadoop YARN Server ......................... SUCCESS [  0.059 s]
[INFO] Apache Hadoop YARN Server Common .................. SUCCESS [ 35.381 s]
[INFO] Apache Hadoop YARN NodeManager .................... SUCCESS [06:17 min]
[INFO] Apache Hadoop YARN Web Proxy ...................... SUCCESS [ 14.483 s]
[INFO] Apache Hadoop YARN ApplicationHistoryService ...... SUCCESS [03:02 min]
[INFO] Apache Hadoop YARN ResourceManager ................ FAILURE [  01:02 h]
[INFO] Apache Hadoop YARN Server Tests ................... SKIPPED
[INFO] Apache Hadoop YARN Client ......................... SKIPPED
[INFO] Apache Hadoop YARN SharedCacheManager ............. SKIPPED
[INFO] Apache Hadoop YARN Applications ................... SKIPPED
[INFO] Apache Hadoop YARN DistributedShell ............... SKIPPED
[INFO] Apache Hadoop YARN Unmanaged Am Launcher .......... SKIPPED
[INFO] Apache Hadoop YARN Site ........................... SKIPPED
[INFO] Apache Hadoop YARN Registry ....................... SKIPPED
[INFO] Apache Hadoop YARN Project ........................ SKIPPED
[INFO] ------------------------------------------------------------------------
[INFO] BUILD FAILURE
[INFO] ------------------------------------------------------------------------
[INFO] Total time: 01:16 h
[INFO] Finished at: 2015-05-12T12:16:43+00:00
[INFO] Final Memory: 68M/1036M
[INFO] ------------------------------------------------------------------------
[ERROR] Failed to execute goal org.apache.maven.plugins:maven-surefire-plugin:2.17:test (default-test)
on project hadoop-yarn-server-resourcemanager: There was a timeout or other error in the fork
-> [Help 1]
[ERROR] 
[ERROR] To see the full stack trace of the errors, re-run Maven with the -e switch.
[ERROR] Re-run Maven using the -X switch to enable full debug logging.
[ERROR] 
[ERROR] For more information about the errors and possible solutions, please read the following
articles:
[ERROR] [Help 1] http://cwiki.apache.org/confluence/display/MAVEN/MojoFailureException
[ERROR] 
[ERROR] After correcting the problems, you can resume the build with the command
[ERROR]   mvn <goals> -rf :hadoop-yarn-server-resourcemanager
Build step 'Execute shell' marked build as failure
Archiving artifacts
Recording test results
Updating HADOOP-11947
Updating HDFS-8241
Updating HADOOP-11948
Updating HDFS-7916
Updating MAPREDUCE-5465
Updating HDFS-8362
Updating HADOOP-11881
Updating YARN-3587
Updating HADOOP-11928
Updating YARN-3434
Updating MAPREDUCE-6360
Updating YARN-3493
Updating HADOOP-11663
Updating HADOOP-11951
Updating YARN-3489
Updating HADOOP-11950

Mime
View raw message