hadoop-yarn-dev mailing list archives

Site index · List index
Message view « Date » · « Thread »
Top « Date » · « Thread »
From Apache Jenkins Server <jenk...@builds.apache.org>
Subject Failed: YARN-3169 PreCommit Build #7795
Date Fri, 08 May 2015 09:52:19 GMT
Jira: https://issues.apache.org/jira/browse/YARN-3169
Build: https://builds.apache.org/job/PreCommit-YARN-Build/7795/

###################################################################################
########################## LAST 60 LINES OF THE CONSOLE ###########################
[...truncated 175 lines...]
+1 overall

| Vote |         Subsystem |  Runtime   | Comment
============================================================================
|   0  |        pre-patch  |  2m 59s    | Pre-patch trunk compilation is 
|      |                   |            | healthy.
|  +1  |          @author  |  0m 0s     | The patch does not contain any 
|      |                   |            | @author tags.
|  +1  |    release audit  |  0m 21s    | The applied patch does not increase 
|      |                   |            | the total number of release audit
|      |                   |            | warnings.
|  +1  |             site  |  2m 56s    | Site still builds. 
|  +1  |       whitespace  |  0m 0s     | The patch has no lines that end in 
|      |                   |            | whitespace.
|      |                   |  6m 19s    | 


|| Subsystem || Report/Notes ||
============================================================================
| Patch URL | http://issues.apache.org/jira/secure/attachment/12731407/YARN-3169-003.patch
|
| Optional Tests | site |
| git revision | trunk / 4c6816f |
| Java | 1.7.0_55 |
| uname | Linux asf904.gq1.ygridcore.net 3.13.0-36-lowlatency #63-Ubuntu SMP PREEMPT Wed Sep
3 21:56:12 UTC 2014 x86_64 x86_64 x86_64 GNU/Linux |


============================================================================
============================================================================
                          Adding comment to JIRA
============================================================================
============================================================================


Unable to log in to server: https://issues.apache.org/jira/rpc/soap/jirasoapservice-v2 with
user: hadoopqa.
 Cause: com.atlassian.jira.rpc.exception.RemoteAuthenticationException: Attempt to log in
user 'hadoopqa' failed. The maximum number of failed login attempts has been reached. Please
log into the application through the web interface to reset the number of failed login attempts.
Unable to log in to server: https://issues.apache.org/jira/rpc/soap/jirasoapservice-v2 with
user: hadoopqa.
 Cause: com.atlassian.jira.rpc.exception.RemoteAuthenticationException: Attempt to log in
user 'hadoopqa' failed. The maximum number of failed login attempts has been reached. Please
log into the application through the web interface to reset the number of failed login attempts.


============================================================================
============================================================================
                              Finished build.
============================================================================
============================================================================


Archiving artifacts
Sending artifact delta relative to PreCommit-YARN-Build #7789
Archived 8 artifacts
Archive block size is 32768
Received 0 blocks and 2305616 bytes
Compression is 0.0%
Took 5.5 sec
Description set: YARN-3169
Recording test results
No test report files were found. Configuration error?
Build step 'Publish JUnit test result report' changed build result to FAILURE
Email was triggered for: Failure
Sending email for trigger: Failure



###################################################################################
############################## FAILED TESTS (if any) ##############################
No tests ran.
Mime
  • Unnamed multipart/mixed (inline, None, 0 bytes)
View raw message