hadoop-yarn-dev mailing list archives

Site index · List index
Message view « Date » · « Thread »
Top « Date » · « Thread »
From "Li Lu (JIRA)" <j...@apache.org>
Subject [jira] [Created] (YARN-3459) TestLog4jWarningErrorMetricsAppender breaks in trunk
Date Tue, 07 Apr 2015 18:17:12 GMT
Li Lu created YARN-3459:
---------------------------

             Summary: TestLog4jWarningErrorMetricsAppender breaks in trunk
                 Key: YARN-3459
                 URL: https://issues.apache.org/jira/browse/YARN-3459
             Project: Hadoop YARN
          Issue Type: Bug
            Reporter: Li Lu
            Assignee: Li Lu
            Priority: Blocker
             Fix For: 2.7.0


TestLog4jWarningErrorMetricsAppender fails with the following message:
{code}
Running org.apache.hadoop.yarn.util.TestLog4jWarningErrorMetricsAppender
Tests run: 6, Failures: 1, Errors: 0, Skipped: 0, Time elapsed: 6.214 sec <<< FAILURE!
- in org.apache.hadoop.yarn.util.TestLog4jWarningErrorMetricsAppender
testPurge(org.apache.hadoop.yarn.util.TestLog4jWarningErrorMetricsAppender)  Time elapsed:
2.01 sec  <<< FAILURE!
java.lang.AssertionError: expected:<0> but was:<1>
	at org.junit.Assert.fail(Assert.java:88)
	at org.junit.Assert.failNotEquals(Assert.java:743)
	at org.junit.Assert.assertEquals(Assert.java:118)
	at org.junit.Assert.assertEquals(Assert.java:555)
	at org.junit.Assert.assertEquals(Assert.java:542)
	at org.apache.hadoop.yarn.util.TestLog4jWarningErrorMetricsAppender.testPurge(TestLog4jWarningErrorMetricsAppender.java:89)
{code}



--
This message was sent by Atlassian JIRA
(v6.3.4#6332)

Mime
View raw message