hadoop-yarn-dev mailing list archives

Site index · List index
Message view « Date » · « Thread »
Top « Date » · « Thread »
From Apache Jenkins Server <jenk...@builds.apache.org>
Subject Failed: YARN-3472 PreCommit Build #7317
Date Mon, 13 Apr 2015 19:09:05 GMT
Jira: https://issues.apache.org/jira/browse/YARN-3472
Build: https://builds.apache.org/job/PreCommit-YARN-Build/7317/

###################################################################################
########################## LAST 60 LINES OF THE CONSOLE ###########################
[...truncated 3219 lines...]

    {color:green}+1 javadoc{color}.  There were no new javadoc warning messages.

    {color:green}+1 eclipse:eclipse{color}.  The patch built with eclipse:eclipse.

    {color:green}+1 findbugs{color}.  The patch does not introduce any new Findbugs (version
2.0.3) warnings.

    {color:green}+1 release audit{color}.  The applied patch does not increase the total number
of release audit warnings.

    {color:red}-1 core tests{color}.  The patch failed these unit tests in hadoop-yarn-project/hadoop-yarn/hadoop-yarn-server/hadoop-yarn-server-resourcemanager:

                  org.apache.hadoop.yarn.server.resourcemanager.scheduler.fair.TestAllocationFileLoaderService

Test results: https://builds.apache.org/job/PreCommit-YARN-Build/7317//testReport/
Console output: https://builds.apache.org/job/PreCommit-YARN-Build/7317//console

This message is automatically generated.


======================================================================
======================================================================
    Adding comment to Jira.
======================================================================
======================================================================


Comment added.
865d4e262873cb45b1e29be877a99da2843fb116 logged out


======================================================================
======================================================================
    Finished build.
======================================================================
======================================================================


Build step 'Execute shell' marked build as failure
Archiving artifacts
Sending artifact delta relative to PreCommit-YARN-Build #7308
ERROR: Failed to archive {patchprocess/patchJavacWarnings.txt=patchprocess/patchJavacWarnings.txt,
patchprocess/trunkJavacWarnings.txt=patchprocess/trunkJavacWarnings.txt, patchprocess/trunkJavadocWarnings.txt=patchprocess/trunkJavadocWarnings.txt}
due to internal error; falling back to full archiving
java.lang.IllegalStateException: checksum mismatch after transfer (6581801202181819975 vs.
4028516862); /x1/jenkins/jenkins-home/jobs/PreCommit-YARN-Build/builds/2015-04-13_17-45-35/archive/patchprocess/patchJavacWarnings.txt
may be corrupted
	at jsync.protocol.FileSequenceReader.read(FileSequenceReader.java:45)
	at com.cloudbees.jenkins.plugins.jsync.archiver.JSyncArtifactManager.remoteSync(JSyncArtifactManager.java:145)
	at com.cloudbees.jenkins.plugins.jsync.archiver.JSyncArtifactManager.archive(JSyncArtifactManager.java:68)
	at hudson.tasks.ArtifactArchiver.perform(ArtifactArchiver.java:140)
	at hudson.tasks.BuildStepMonitor$1.perform(BuildStepMonitor.java:20)
	at hudson.model.AbstractBuild$AbstractBuildExecution.perform(AbstractBuild.java:756)
	at hudson.model.AbstractBuild$AbstractBuildExecution.performAllBuildSteps(AbstractBuild.java:720)
	at hudson.model.Build$BuildExecution.post2(Build.java:182)
	at hudson.model.AbstractBuild$AbstractBuildExecution.post(AbstractBuild.java:669)
	at hudson.model.Run.execute(Run.java:1731)
	at hudson.model.FreeStyleBuild.run(FreeStyleBuild.java:43)
	at hudson.model.ResourceController.execute(ResourceController.java:88)
	at hudson.model.Executor.run(Executor.java:232)
[description-setter] Could not determine description.
Recording test results
Email was triggered for: Failure
Sending email for trigger: Failure



###################################################################################
############################## FAILED TESTS (if any) ##############################
1 tests failed.
REGRESSION:  org.apache.hadoop.yarn.server.resourcemanager.scheduler.fair.TestAllocationFileLoaderService.testGetAllocationFileFromClasspath

Error Message:
null

Stack Trace:
java.lang.AssertionError: null
	at org.junit.Assert.fail(Assert.java:86)
	at org.junit.Assert.assertTrue(Assert.java:41)
	at org.junit.Assert.assertTrue(Assert.java:52)
	at org.apache.hadoop.yarn.server.resourcemanager.scheduler.fair.TestAllocationFileLoaderService.testGetAllocationFileFromClasspath(TestAllocationFileLoaderService.java:66)



Mime
  • Unnamed multipart/mixed (inline, None, 0 bytes)
View raw message