hadoop-yarn-dev mailing list archives

Site index · List index
Message view « Date » · « Thread »
Top « Date » · « Thread »
From Apache Jenkins Server <jenk...@builds.apache.org>
Subject Failed: YARN-3348 PreCommit Build #7235
Date Tue, 07 Apr 2015 14:44:45 GMT
Jira: https://issues.apache.org/jira/browse/YARN-3348
Build: https://builds.apache.org/job/PreCommit-YARN-Build/7235/

###################################################################################
########################## LAST 60 LINES OF THE CONSOLE ###########################
[...truncated 3940 lines...]
  http://issues.apache.org/jira/secure/attachment/12723624/apache-yarn-3348.0.patch
  against trunk revision 75c5454.

    {color:green}+1 @author{color}.  The patch does not contain any @author tags.

    {color:green}+1 tests included{color}.  The patch appears to include 4 new or modified
test files.

    {color:green}+1 javac{color}.  The applied patch does not increase the total number of
javac compiler warnings.

    {color:green}+1 javadoc{color}.  There were no new javadoc warning messages.

    {color:green}+1 eclipse:eclipse{color}.  The patch built with eclipse:eclipse.

    {color:red}-1 findbugs{color}.  The patch appears to introduce 2 new Findbugs (version
2.0.3) warnings.

        {color:red}-1 release audit{color}.  The applied patch generated 1 release audit warnings.

    {color:red}-1 core tests{color}.  The patch failed these unit tests in hadoop-yarn-project/hadoop-yarn/hadoop-yarn-api
hadoop-yarn-project/hadoop-yarn/hadoop-yarn-client hadoop-yarn-project/hadoop-yarn/hadoop-yarn-common
hadoop-yarn-project/hadoop-yarn/hadoop-yarn-server/hadoop-yarn-server-resourcemanager:

                  org.apache.hadoop.yarn.api.TestPBImplRecords

Test results: https://builds.apache.org/job/PreCommit-YARN-Build/7235//testReport/
Release audit warnings: https://builds.apache.org/job/PreCommit-YARN-Build/7235//artifact/patchprocess/patchReleaseAuditProblems.txt
Findbugs warnings: https://builds.apache.org/job/PreCommit-YARN-Build/7235//artifact/patchprocess/newPatchFindbugsWarningshadoop-yarn-common.html
Console output: https://builds.apache.org/job/PreCommit-YARN-Build/7235//console

This message is automatically generated.


======================================================================
======================================================================
    Adding comment to Jira.
======================================================================
======================================================================


Comment added.
d87ca5b55909e9425e7d838ec0a0308307f8a67a logged out


======================================================================
======================================================================
    Finished build.
======================================================================
======================================================================


Build step 'Execute shell' marked build as failure
Archiving artifacts
Sending artifact delta relative to PreCommit-YARN-Build #7234
Archived 31 artifacts
Archive block size is 32768
Received 39 blocks and 8040713 bytes
Compression is 13.7%
Took 6.5 sec
[description-setter] Could not determine description.
Recording test results
Email was triggered for: Failure
Sending email for trigger: Failure



###################################################################################
############################## FAILED TESTS (if any) ##############################
2 tests failed.
FAILED:  org.apache.hadoop.yarn.api.TestPBImplRecords.testGetApplicationsRequestPBImpl

Error Message:
property org.apache.hadoop.yarn.api.protocolrecords.impl.pb.GetApplicationsRequestPBImpl#FetchCachedResponse
should be equal expected:<false> but was:<true>

Stack Trace:
java.lang.AssertionError: property org.apache.hadoop.yarn.api.protocolrecords.impl.pb.GetApplicationsRequestPBImpl#FetchCachedResponse
should be equal expected:<false> but was:<true>
	at org.junit.Assert.fail(Assert.java:88)
	at org.junit.Assert.failNotEquals(Assert.java:743)
	at org.junit.Assert.assertEquals(Assert.java:118)
	at org.apache.hadoop.yarn.api.TestPBImplRecords.validatePBImplRecord(TestPBImplRecords.java:602)
	at org.apache.hadoop.yarn.api.TestPBImplRecords.testGetApplicationsRequestPBImpl(TestPBImplRecords.java:679)


FAILED:  org.apache.hadoop.yarn.api.TestPBImplRecords.testQueueInfoPBImpl

Error Message:
type class org.apache.hadoop.yarn.api.records.QueueStatistics is not supported

Stack Trace:
java.lang.IllegalArgumentException: type class org.apache.hadoop.yarn.api.records.QueueStatistics
is not supported
	at org.apache.hadoop.yarn.api.TestPBImplRecords.genTypeValue(TestPBImplRecords.java:395)
	at org.apache.hadoop.yarn.api.TestPBImplRecords.getGetSetPairs(TestPBImplRecords.java:571)
	at org.apache.hadoop.yarn.api.TestPBImplRecords.validatePBImplRecord(TestPBImplRecords.java:586)
	at org.apache.hadoop.yarn.api.TestPBImplRecords.testQueueInfoPBImpl(TestPBImplRecords.java:1031)



Mime
  • Unnamed multipart/mixed (inline, None, 0 bytes)
View raw message