hadoop-yarn-dev mailing list archives

Site index · List index
Message view « Date » · « Thread »
Top « Date » · « Thread »
From Apache Jenkins Server <jenk...@builds.apache.org>
Subject Failed: YARN-2268 PreCommit Build #7375
Date Fri, 17 Apr 2015 12:39:10 GMT
Jira: https://issues.apache.org/jira/browse/YARN-2268
Build: https://builds.apache.org/job/PreCommit-YARN-Build/7375/

###################################################################################
########################## LAST 60 LINES OF THE CONSOLE ###########################
[...truncated 3763 lines...]
  http://issues.apache.org/jira/secure/attachment/12726128/0001-YARN-2268.patch
  against trunk revision 76e7264.

    {color:green}+1 @author{color}.  The patch does not contain any @author tags.

    {color:green}+1 tests included{color}.  The patch appears to include 1 new or modified
test files.

    {color:green}+1 javac{color}.  The applied patch does not increase the total number of
javac compiler warnings.

    {color:red}-1 javadoc{color}.  The javadoc tool appears to have generated 1 warning messages.
        See https://builds.apache.org/job/PreCommit-YARN-Build/7375//artifact/patchprocess/diffJavadocWarnings.txt
for details.

    {color:green}+1 eclipse:eclipse{color}.  The patch built with eclipse:eclipse.

    {color:red}-1 findbugs{color}.  The patch appears to introduce 2 new Findbugs (version
2.0.3) warnings.

    {color:green}+1 release audit{color}.  The applied patch does not increase the total number
of release audit warnings.

    {color:red}-1 core tests{color}.  The patch failed these unit tests in hadoop-yarn-project/hadoop-yarn/hadoop-yarn-common
hadoop-yarn-project/hadoop-yarn/hadoop-yarn-server/hadoop-yarn-server-resourcemanager:

                  org.apache.hadoop.yarn.server.resourcemanager.TestRM

Test results: https://builds.apache.org/job/PreCommit-YARN-Build/7375//testReport/
Findbugs warnings: https://builds.apache.org/job/PreCommit-YARN-Build/7375//artifact/patchprocess/newPatchFindbugsWarningshadoop-yarn-server-resourcemanager.html
Console output: https://builds.apache.org/job/PreCommit-YARN-Build/7375//console

This message is automatically generated.


======================================================================
======================================================================
    Adding comment to Jira.
======================================================================
======================================================================


Comment added.
6c685affd663b3c49947e89030845711ee743f17 logged out


======================================================================
======================================================================
    Finished build.
======================================================================
======================================================================


Build step 'Execute shell' marked build as failure
Archiving artifacts
Sending artifact delta relative to PreCommit-YARN-Build #7372
Archived 20 artifacts
Archive block size is 32768
Received 55 blocks and 7704876 bytes
Compression is 19.0%
Took 2 sec
[description-setter] Could not determine description.
Recording test results
Email was triggered for: Failure
Sending email for trigger: Failure



###################################################################################
############################## FAILED TESTS (if any) ##############################
1 tests failed.
FAILED:  org.apache.hadoop.yarn.server.resourcemanager.TestRM.testRMServerUtils[1]

Error Message:
null

Stack Trace:
java.lang.AssertionError: null
	at org.junit.Assert.fail(Assert.java:86)
	at org.junit.Assert.assertTrue(Assert.java:41)
	at org.junit.Assert.assertFalse(Assert.java:64)
	at org.junit.Assert.assertFalse(Assert.java:74)
	at org.apache.hadoop.yarn.server.resourcemanager.TestRM.testRMServerUtils(TestRM.java:762)



Mime
  • Unnamed multipart/mixed (inline, None, 0 bytes)
View raw message