hadoop-yarn-dev mailing list archives

Site index · List index
Message view « Date » · « Thread »
Top « Date » · « Thread »
From Apache Jenkins Server <jenk...@builds.apache.org>
Subject Failed: YARN-3354 PreCommit Build #7335
Date Tue, 14 Apr 2015 23:28:31 GMT
Jira: https://issues.apache.org/jira/browse/YARN-3354
Build: https://builds.apache.org/job/PreCommit-YARN-Build/7335/

###################################################################################
########################## LAST 60 LINES OF THE CONSOLE ###########################
[...truncated 3916 lines...]



{color:red}-1 overall{color}.  Here are the results of testing the latest attachment 
  http://issues.apache.org/jira/secure/attachment/12725400/YARN-3354.2.patch
  against trunk revision 05007b4.

    {color:green}+1 @author{color}.  The patch does not contain any @author tags.

    {color:green}+1 tests included{color}.  The patch appears to include 4 new or modified test files.

    {color:green}+1 javac{color}.  The applied patch does not increase the total number of javac compiler warnings.

    {color:green}+1 javadoc{color}.  There were no new javadoc warning messages.

    {color:green}+1 eclipse:eclipse{color}.  The patch built with eclipse:eclipse.

    {color:green}+1 findbugs{color}.  The patch does not introduce any new Findbugs (version 2.0.3) warnings.

    {color:green}+1 release audit{color}.  The applied patch does not increase the total number of release audit warnings.

    {color:red}-1 core tests{color}.  The patch failed these unit tests in hadoop-yarn-project/hadoop-yarn/hadoop-yarn-common hadoop-yarn-project/hadoop-yarn/hadoop-yarn-server/hadoop-yarn-server-common hadoop-yarn-project/hadoop-yarn/hadoop-yarn-server/hadoop-yarn-server-nodemanager hadoop-yarn-project/hadoop-yarn/hadoop-yarn-server/hadoop-yarn-server-resourcemanager:

                  org.apache.hadoop.yarn.server.resourcemanager.webapp.TestRMWebServicesApps
                  org.apache.hadoop.yarn.server.resourcemanager.applicationsmanager.TestAMRMRPCResponseId
                  org.apache.hadoop.yarn.server.resourcemanager.applicationsmanager.TestAMRestart
                  org.apache.hadoop.yarn.server.resourcemanager.TestRMRestart
                  org.apache.hadoop.yarn.server.resourcemanager.ahs.TestRMApplicationHistoryWriter

Test results: https://builds.apache.org/job/PreCommit-YARN-Build/7335//testReport/
Console output: https://builds.apache.org/job/PreCommit-YARN-Build/7335//console

This message is automatically generated.


======================================================================
======================================================================
    Adding comment to Jira.
======================================================================
======================================================================


Comment added.
168cc826ea77f7bd5489c5defa83e4d2b48771e4 logged out


======================================================================
======================================================================
    Finished build.
======================================================================
======================================================================


Build step 'Execute shell' marked build as failure
Archiving artifacts
[description-setter] Could not determine description.
Recording test results
Email was triggered for: Failure
Sending email for trigger: Failure



###################################################################################
############################## FAILED TESTS (if any) ##############################
37 tests failed.
REGRESSION:  org.apache.hadoop.yarn.server.resourcemanager.TestRMRestart.testAppAttemptTokensRestoredOnRMRestart[1]

Error Message:
org.xml.sax.SAXParseException; systemId: jar:file:/home/jenkins/.m2/repository/org/apache/hadoop/hadoop-common/3.0.0-SNAPSHOT/hadoop-common-3.0.0-SNAPSHOT.jar!/core-default.xml; lineNumber: 1; columnNumber: 1; Invalid byte 1 of 1-byte UTF-8 sequence.

Stack Trace:
java.lang.RuntimeException: org.xml.sax.SAXParseException; systemId: jar:file:/home/jenkins/.m2/repository/org/apache/hadoop/hadoop-common/3.0.0-SNAPSHOT/hadoop-common-3.0.0-SNAPSHOT.jar!/core-default.xml; lineNumber: 1; columnNumber: 1; Invalid byte 1 of 1-byte UTF-8 sequence.
	at org.apache.hadoop.conf.Configuration.loadResource(Configuration.java:2728)
	at org.apache.hadoop.conf.Configuration.loadResources(Configuration.java:2560)
	at org.apache.hadoop.conf.Configuration.getProps(Configuration.java:2471)
	at org.apache.hadoop.conf.Configuration.set(Configuration.java:1207)
	at org.apache.hadoop.conf.Configuration.set(Configuration.java:1179)
	at org.apache.hadoop.yarn.server.resourcemanager.ParameterizedSchedulerTestBase.configureFairScheduler(ParameterizedSchedulerTestBase.java:97)
	at org.apache.hadoop.yarn.server.resourcemanager.ParameterizedSchedulerTestBase.configureScheduler(ParameterizedSchedulerTestBase.java:75)
	at sun.reflect.GeneratedMethodAccessor62.invoke(Unknown Source)
	at sun.reflect.DelegatingMethodAccessorImpl.invoke(DelegatingMethodAccessorImpl.java:43)
	at java.lang.reflect.Method.invoke(Method.java:606)
	at org.junit.runners.model.FrameworkMethod$1.runReflectiveCall(FrameworkMethod.java:47)
	at org.junit.internal.runners.model.ReflectiveCallable.run(ReflectiveCallable.java:12)
	at org.junit.runners.model.FrameworkMethod.invokeExplosively(FrameworkMethod.java:44)
	at org.junit.internal.runners.statements.RunBefores.evaluate(RunBefores.java:24)
	at org.junit.internal.runners.statements.RunAfters.evaluate(RunAfters.java:27)
	at org.junit.runners.ParentRunner.runLeaf(ParentRunner.java:271)
	at org.junit.runners.BlockJUnit4ClassRunner.runChild(BlockJUnit4ClassRunner.java:70)
	at org.junit.runners.BlockJUnit4ClassRunner.runChild(BlockJUnit4ClassRunner.java:50)
	at org.junit.runners.ParentRunner$3.run(ParentRunner.java:238)
	at org.junit.runners.ParentRunner$1.schedule(ParentRunner.java:63)
	at org.junit.runners.ParentRunner.runChildren(ParentRunner.java:236)
	at org.junit.runners.ParentRunner.access$000(ParentRunner.java:53)
	at org.junit.runners.ParentRunner$2.evaluate(ParentRunner.java:229)
	at org.junit.runners.ParentRunner.run(ParentRunner.java:309)
	at org.junit.runners.Suite.runChild(Suite.java:127)
	at org.junit.runners.Suite.runChild(Suite.java:26)
	at org.junit.runners.ParentRunner$3.run(ParentRunner.java:238)
	at org.junit.runners.ParentRunner$1.schedule(ParentRunner.java:63)
	at org.junit.runners.ParentRunner.runChildren(ParentRunner.java:236)
	at org.junit.runners.ParentRunner.access$000(ParentRunner.java:53)
	at org.junit.runners.ParentRunner$2.evaluate(ParentRunner.java:229)
	at org.junit.runners.ParentRunner.run(ParentRunner.java:309)
	at org.apache.maven.surefire.junit4.JUnit4Provider.execute(JUnit4Provider.java:264)
	at org.apache.maven.surefire.junit4.JUnit4Provider.executeTestSet(JUnit4Provider.java:153)
	at org.apache.maven.surefire.junit4.JUnit4Provider.invoke(JUnit4Provider.java:124)
	at org.apache.maven.surefire.booter.ForkedBooter.invokeProviderInSameClassLoader(ForkedBooter.java:200)
	at org.apache.maven.surefire.booter.ForkedBooter.runSuitesInProcess(ForkedBooter.java:153)
	at org.apache.maven.surefire.booter.ForkedBooter.main(ForkedBooter.java:103)
Caused by: org.xml.sax.SAXParseException: Invalid byte 1 of 1-byte UTF-8 sequence.
	at org.apache.xerces.parsers.DOMParser.parse(Unknown Source)
	at org.apache.xerces.jaxp.DocumentBuilderImpl.parse(Unknown Source)
	at javax.xml.parsers.DocumentBuilder.parse(DocumentBuilder.java:150)
	at org.apache.hadoop.conf.Configuration.parse(Configuration.java:2548)
	at org.apache.hadoop.conf.Configuration.parse(Configuration.java:2536)
	at org.apache.hadoop.conf.Configuration.loadResource(Configuration.java:2607)
	at org.apache.hadoop.conf.Configuration.loadResources(Configuration.java:2560)
	at org.apache.hadoop.conf.Configuration.getProps(Configuration.java:2471)
	at org.apache.hadoop.conf.Configuration.set(Configuration.java:1207)
	at org.apache.hadoop.conf.Configuration.set(Configuration.java:1179)
	at org.apache.hadoop.yarn.server.resourcemanager.ParameterizedSchedulerTestBase.configureFairScheduler(ParameterizedSchedulerTestBase.java:97)
	at org.apache.hadoop.yarn.server.resourcemanager.ParameterizedSchedulerTestBase.configureScheduler(ParameterizedSchedulerTestBase.java:75)
	at sun.reflect.GeneratedMethodAccessor62.invoke(Unknown Source)
	at sun.reflect.DelegatingMethodAccessorImpl.invoke(DelegatingMethodAccessorImpl.java:43)
	at java.lang.reflect.Method.invoke(Method.java:606)
	at org.junit.runners.model.FrameworkMethod$1.runReflectiveCall(FrameworkMethod.java:47)
	at org.junit.internal.runners.model.ReflectiveCallable.run(ReflectiveCallable.java:12)
	at org.junit.runners.model.FrameworkMethod.invokeExplosively(FrameworkMethod.java:44)
	at org.junit.internal.runners.statements.RunBefores.evaluate(RunBefores.java:24)
	at org.junit.internal.runners.statements.RunAfters.evaluate(RunAfters.java:27)
	at org.junit.runners.ParentRunner.runLeaf(ParentRunner.java:271)
	at org.junit.runners.BlockJUnit4ClassRunner.runChild(BlockJUnit4ClassRunner.java:70)
	at org.junit.runners.BlockJUnit4ClassRunner.runChild(BlockJUnit4ClassRunner.java:50)
	at org.junit.runners.ParentRunner$3.run(ParentRunner.java:238)
	at org.junit.runners.ParentRunner$1.schedule(ParentRunner.java:63)
	at org.junit.runners.ParentRunner.runChildren(ParentRunner.java:236)
	at org.junit.runners.ParentRunner.access$000(ParentRunner.java:53)
	at org.junit.runners.ParentRunner$2.evaluate(ParentRunner.java:229)
	at org.junit.runners.ParentRunner.run(ParentRunner.java:309)
	at org.junit.runners.Suite.runChild(Suite.java:127)
	at org.junit.runners.Suite.runChild(Suite.java:26)
	at org.junit.runners.ParentRunner$3.run(ParentRunner.java:238)
	at org.junit.runners.ParentRunner$1.schedule(ParentRunner.java:63)
	at org.junit.runners.ParentRunner.runChildren(ParentRunner.java:236)
	at org.junit.runners.ParentRunner.access$000(ParentRunner.java:53)
	at org.junit.runners.ParentRunner$2.evaluate(ParentRunner.java:229)
	at org.junit.runners.ParentRunner.run(ParentRunner.java:309)
	at org.apache.maven.surefire.junit4.JUnit4Provider.execute(JUnit4Provider.java:264)
	at org.apache.maven.surefire.junit4.JUnit4Provider.executeTestSet(JUnit4Provider.java:153)
	at org.apache.maven.surefire.junit4.JUnit4Provider.invoke(JUnit4Provider.java:124)
	at org.apache.maven.surefire.booter.ForkedBooter.invokeProviderInSameClassLoader(ForkedBooter.java:200)
	at org.apache.maven.surefire.booter.ForkedBooter.runSuitesInProcess(ForkedBooter.java:153)
	at org.apache.maven.surefire.booter.ForkedBooter.main(ForkedBooter.java:103)
Caused by: org.apache.xerces.impl.io.MalformedByteSequenceException: Invalid byte 1 of 1-byte UTF-8 sequence.
	at org.apache.xerces.impl.io.UTF8Reader.invalidByte(Unknown Source)
	at org.apache.xerces.impl.io.UTF8Reader.read(Unknown Source)
	at org.apache.xerces.impl.XMLEntityScanner.load(Unknown Source)
	at org.apache.xerces.impl.XMLEntityScanner.skipString(Unknown Source)
	at org.apache.xerces.impl.XMLVersionDetector.determineDocVersion(Unknown Source)
	at org.apache.xerces.parsers.XML11Configuration.parse(Unknown Source)
	at org.apache.xerces.parsers.XML11Configuration.parse(Unknown Source)
	at org.apache.xerces.parsers.XMLParser.parse(Unknown Source)
	at org.apache.xerces.parsers.DOMParser.parse(Unknown Source)
	at org.apache.xerces.jaxp.DocumentBuilderImpl.parse(Unknown Source)
	at javax.xml.parsers.DocumentBuilder.parse(DocumentBuilder.java:150)
	at org.apache.hadoop.conf.Configuration.parse(Configuration.java:2548)
	at org.apache.hadoop.conf.Configuration.parse(Configuration.java:2536)
	at org.apache.hadoop.conf.Configuration.loadResource(Configuration.java:2607)
	at org.apache.hadoop.conf.Configuration.loadResources(Configuration.java:2560)
	at org.apache.hadoop.conf.Configuration.getProps(Configuration.java:2471)
	at org.apache.hadoop.conf.Configuration.set(Configuration.java:1207)
	at org.apache.hadoop.conf.Configuration.set(Configuration.java:1179)
	at org.apache.hadoop.yarn.server.resourcemanager.ParameterizedSchedulerTestBase.configureFairScheduler(ParameterizedSchedulerTestBase.java:97)
	at org.apache.hadoop.yarn.server.resourcemanager.ParameterizedSchedulerTestBase.configureScheduler(ParameterizedSchedulerTestBase.java:75)
	at sun.reflect.GeneratedMethodAccessor62.invoke(Unknown Source)
	at sun.reflect.DelegatingMethodAccessorImpl.invoke(DelegatingMethodAccessorImpl.java:43)
	at java.lang.reflect.Method.invoke(Method.java:606)
	at org.junit.runners.model.FrameworkMethod$1.runReflectiveCall(FrameworkMethod.java:47)
	at org.junit.internal.runners.model.ReflectiveCallable.run(ReflectiveCallable.java:12)
	at org.junit.runners.model.FrameworkMethod.invokeExplosively(FrameworkMethod.java:44)
	at org.junit.internal.runners.statements.RunBefores.evaluate(RunBefores.java:24)
	at org.junit.internal.runners.statements.RunAfters.evaluate(RunAfters.java:27)
	at org.junit.runners.ParentRunner.runLeaf(ParentRunner.java:271)
	at org.junit.runners.BlockJUnit4ClassRunner.runChild(BlockJUnit4ClassRunner.java:70)
	at org.junit.runners.BlockJUnit4ClassRunner.runChild(BlockJUnit4ClassRunner.java:50)
	at org.junit.runners.ParentRunner$3.run(ParentRunner.java:238)
	at org.junit.runners.ParentRunner$1.schedule(ParentRunner.java:63)
	at org.junit.runners.ParentRunner.runChildren(ParentRunner.java:236)
	at org.junit.runners.ParentRunner.access$000(ParentRunner.java:53)
	at org.junit.runners.ParentRunner$2.evaluate(ParentRunner.java:229)
	at org.junit.runners.ParentRunner.run(ParentRunner.java:309)
	at org.junit.runners.Suite.runChild(Suite.java:127)
	at org.junit.runners.Suite.runChild(Suite.java:26)
	at org.junit.runners.ParentRunner$3.run(ParentRunner.java:238)
	at org.junit.runners.ParentRunner$1.schedule(ParentRunner.java:63)
	at org.junit.runners.ParentRunner.runChildren(ParentRunner.java:236)
	at org.junit.runners.ParentRunner.access$000(ParentRunner.java:53)
	at org.junit.runners.ParentRunner$2.evaluate(ParentRunner.java:229)
	at org.junit.runners.ParentRunner.run(ParentRunner.java:309)
	at org.apache.maven.surefire.junit4.JUnit4Provider.execute(JUnit4Provider.java:264)
	at org.apache.maven.surefire.junit4.JUnit4Provider.executeTestSet(JUnit4Provider.java:153)
	at org.apache.maven.surefire.junit4.JUnit4Provider.invoke(JUnit4Provider.java:124)
	at org.apache.maven.surefire.booter.ForkedBooter.invokeProviderInSameClassLoader(ForkedBooter.java:200)
	at org.apache.maven.surefire.booter.ForkedBooter.runSuitesInProcess(ForkedBooter.java:153)
	at org.apache.maven.surefire.booter.ForkedBooter.main(ForkedBooter.java:103)


REGRESSION:  org.apache.hadoop.yarn.server.resourcemanager.TestRMRestart.testRMRestart[1]

Error Message:
org.xml.sax.SAXParseException; systemId: jar:file:/home/jenkins/.m2/repository/org/apache/hadoop/hadoop-common/3.0.0-SNAPSHOT/hadoop-common-3.0.0-SNAPSHOT.jar!/core-default.xml; lineNumber: 1; columnNumber: 1; Invalid byte 1 of 1-byte UTF-8 sequence.

Stack Trace:
java.lang.RuntimeException: org.xml.sax.SAXParseException; systemId: jar:file:/home/jenkins/.m2/repository/org/apache/hadoop/hadoop-common/3.0.0-SNAPSHOT/hadoop-common-3.0.0-SNAPSHOT.jar!/core-default.xml; lineNumber: 1; columnNumber: 1; Invalid byte 1 of 1-byte UTF-8 sequence.
	at org.apache.hadoop.conf.Configuration.loadResource(Configuration.java:2728)
	at org.apache.hadoop.conf.Configuration.loadResources(Configuration.java:2560)
	at org.apache.hadoop.conf.Configuration.getProps(Configuration.java:2471)
	at org.apache.hadoop.conf.Configuration.set(Configuration.java:1207)
	at org.apache.hadoop.conf.Configuration.set(Configuration.java:1179)
	at org.apache.hadoop.yarn.server.resourcemanager.ParameterizedSchedulerTestBase.configureFairScheduler(ParameterizedSchedulerTestBase.java:97)
	at org.apache.hadoop.yarn.server.resourcemanager.ParameterizedSchedulerTestBase.configureScheduler(ParameterizedSchedulerTestBase.java:75)
	at sun.reflect.GeneratedMethodAccessor62.invoke(Unknown Source)
	at sun.reflect.DelegatingMethodAccessorImpl.invoke(DelegatingMethodAccessorImpl.java:43)
	at java.lang.reflect.Method.invoke(Method.java:606)
	at org.junit.runners.model.FrameworkMethod$1.runReflectiveCall(FrameworkMethod.java:47)
	at org.junit.internal.runners.model.ReflectiveCallable.run(ReflectiveCallable.java:12)
	at org.junit.runners.model.FrameworkMethod.invokeExplosively(FrameworkMethod.java:44)
	at org.junit.internal.runners.statements.RunBefores.evaluate(RunBefores.java:24)
	at org.junit.internal.runners.statements.RunAfters.evaluate(RunAfters.java:27)
	at org.junit.runners.ParentRunner.runLeaf(ParentRunner.java:271)
	at org.junit.runners.BlockJUnit4ClassRunner.runChild(BlockJUnit4ClassRunner.java:70)
	at org.junit.runners.BlockJUnit4ClassRunner.runChild(BlockJUnit4ClassRunner.java:50)
	at org.junit.runners.ParentRunner$3.run(ParentRunner.java:238)
	at org.junit.runners.ParentRunner$1.schedule(ParentRunner.java:63)
	at org.junit.runners.ParentRunner.runChildren(ParentRunner.java:236)
	at org.junit.runners.ParentRunner.access$000(ParentRunner.java:53)
	at org.junit.runners.ParentRunner$2.evaluate(ParentRunner.java:229)
	at org.junit.runners.ParentRunner.run(ParentRunner.java:309)
	at org.junit.runners.Suite.runChild(Suite.java:127)
	at org.junit.runners.Suite.runChild(Suite.java:26)
	at org.junit.runners.ParentRunner$3.run(ParentRunner.java:238)
	at org.junit.runners.ParentRunner$1.schedule(ParentRunner.java:63)
	at org.junit.runners.ParentRunner.runChildren(ParentRunner.java:236)
	at org.junit.runners.ParentRunner.access$000(ParentRunner.java:53)
	at org.junit.runners.ParentRunner$2.evaluate(ParentRunner.java:229)
	at org.junit.runners.ParentRunner.run(ParentRunner.java:309)
	at org.apache.maven.surefire.junit4.JUnit4Provider.execute(JUnit4Provider.java:264)
	at org.apache.maven.surefire.junit4.JUnit4Provider.executeTestSet(JUnit4Provider.java:153)
	at org.apache.maven.surefire.junit4.JUnit4Provider.invoke(JUnit4Provider.java:124)
	at org.apache.maven.surefire.booter.ForkedBooter.invokeProviderInSameClassLoader(ForkedBooter.java:200)
	at org.apache.maven.surefire.booter.ForkedBooter.runSuitesInProcess(ForkedBooter.java:153)
	at org.apache.maven.surefire.booter.ForkedBooter.main(ForkedBooter.java:103)
Caused by: org.xml.sax.SAXParseException: Invalid byte 1 of 1-byte UTF-8 sequence.
	at org.apache.xerces.parsers.DOMParser.parse(Unknown Source)
	at org.apache.xerces.jaxp.DocumentBuilderImpl.parse(Unknown Source)
	at javax.xml.parsers.DocumentBuilder.parse(DocumentBuilder.java:150)
	at org.apache.hadoop.conf.Configuration.parse(Configuration.java:2548)
	at org.apache.hadoop.conf.Configuration.parse(Configuration.java:2536)
	at org.apache.hadoop.conf.Configuration.loadResource(Configuration.java:2607)
	at org.apache.hadoop.conf.Configuration.loadResources(Configuration.java:2560)
	at org.apache.hadoop.conf.Configuration.getProps(Configuration.java:2471)
	at org.apache.hadoop.conf.Configuration.set(Configuration.java:1207)
	at org.apache.hadoop.conf.Configuration.set(Configuration.java:1179)
	at org.apache.hadoop.yarn.server.resourcemanager.ParameterizedSchedulerTestBase.configureFairScheduler(ParameterizedSchedulerTestBase.java:97)
	at org.apache.hadoop.yarn.server.resourcemanager.ParameterizedSchedulerTestBase.configureScheduler(ParameterizedSchedulerTestBase.java:75)
	at sun.reflect.GeneratedMethodAccessor62.invoke(Unknown Source)
	at sun.reflect.DelegatingMethodAccessorImpl.invoke(DelegatingMethodAccessorImpl.java:43)
	at java.lang.reflect.Method.invoke(Method.java:606)
	at org.junit.runners.model.FrameworkMethod$1.runReflectiveCall(FrameworkMethod.java:47)
	at org.junit.internal.runners.model.ReflectiveCallable.run(ReflectiveCallable.java:12)
	at org.junit.runners.model.FrameworkMethod.invokeExplosively(FrameworkMethod.java:44)
	at org.junit.internal.runners.statements.RunBefores.evaluate(RunBefores.java:24)
	at org.junit.internal.runners.statements.RunAfters.evaluate(RunAfters.java:27)
	at org.junit.runners.ParentRunner.runLeaf(ParentRunner.java:271)
	at org.junit.runners.BlockJUnit4ClassRunner.runChild(BlockJUnit4ClassRunner.java:70)
	at org.junit.runners.BlockJUnit4ClassRunner.runChild(BlockJUnit4ClassRunner.java:50)
	at org.junit.runners.ParentRunner$3.run(ParentRunner.java:238)
	at org.junit.runners.ParentRunner$1.schedule(ParentRunner.java:63)
	at org.junit.runners.ParentRunner.runChildren(ParentRunner.java:236)
	at org.junit.runners.ParentRunner.access$000(ParentRunner.java:53)
	at org.junit.runners.ParentRunner$2.evaluate(ParentRunner.java:229)
	at org.junit.runners.ParentRunner.run(ParentRunner.java:309)
	at org.junit.runners.Suite.runChild(Suite.java:127)
	at org.junit.runners.Suite.runChild(Suite.java:26)
	at org.junit.runners.ParentRunner$3.run(ParentRunner.java:238)
	at org.junit.runners.ParentRunner$1.schedule(ParentRunner.java:63)
	at org.junit.runners.ParentRunner.runChildren(ParentRunner.java:236)
	at org.junit.runners.ParentRunner.access$000(ParentRunner.java:53)
	at org.junit.runners.ParentRunner$2.evaluate(ParentRunner.java:229)
	at org.junit.runners.ParentRunner.run(ParentRunner.java:309)
	at org.apache.maven.surefire.junit4.JUnit4Provider.execute(JUnit4Provider.java:264)
	at org.apache.maven.surefire.junit4.JUnit4Provider.executeTestSet(JUnit4Provider.java:153)
	at org.apache.maven.surefire.junit4.JUnit4Provider.invoke(JUnit4Provider.java:124)
	at org.apache.maven.surefire.booter.ForkedBooter.invokeProviderInSameClassLoader(ForkedBooter.java:200)
	at org.apache.maven.surefire.booter.ForkedBooter.runSuitesInProcess(ForkedBooter.java:153)
	at org.apache.maven.surefire.booter.ForkedBooter.main(ForkedBooter.java:103)
Caused by: org.apache.xerces.impl.io.MalformedByteSequenceException: Invalid byte 1 of 1-byte UTF-8 sequence.
	at org.apache.xerces.impl.io.UTF8Reader.invalidByte(Unknown Source)
	at org.apache.xerces.impl.io.UTF8Reader.read(Unknown Source)
	at org.apache.xerces.impl.XMLEntityScanner.load(Unknown Source)
	at org.apache.xerces.impl.XMLEntityScanner.skipString(Unknown Source)
	at org.apache.xerces.impl.XMLVersionDetector.determineDocVersion(Unknown Source)
	at org.apache.xerces.parsers.XML11Configuration.parse(Unknown Source)
	at org.apache.xerces.parsers.XML11Configuration.parse(Unknown Source)
	at org.apache.xerces.parsers.XMLParser.parse(Unknown Source)
	at org.apache.xerces.parsers.DOMParser.parse(Unknown Source)
	at org.apache.xerces.jaxp.DocumentBuilderImpl.parse(Unknown Source)
	at javax.xml.parsers.DocumentBuilder.parse(DocumentBuilder.java:150)
	at org.apache.hadoop.conf.Configuration.parse(Configuration.java:2548)
	at org.apache.hadoop.conf.Configuration.parse(Configuration.java:2536)
	at org.apache.hadoop.conf.Configuration.loadResource(Configuration.java:2607)
	at org.apache.hadoop.conf.Configuration.loadResources(Configuration.java:2560)
	at org.apache.hadoop.conf.Configuration.getProps(Configuration.java:2471)
	at org.apache.hadoop.conf.Configuration.set(Configuration.java:1207)
	at org.apache.hadoop.conf.Configuration.set(Configuration.java:1179)
	at org.apache.hadoop.yarn.server.resourcemanager.ParameterizedSchedulerTestBase.configureFairScheduler(ParameterizedSchedulerTestBase.java:97)
	at org.apache.hadoop.yarn.server.resourcemanager.ParameterizedSchedulerTestBase.configureScheduler(ParameterizedSchedulerTestBase.java:75)
	at sun.reflect.GeneratedMethodAccessor62.invoke(Unknown Source)
	at sun.reflect.DelegatingMethodAccessorImpl.invoke(DelegatingMethodAccessorImpl.java:43)
	at java.lang.reflect.Method.invoke(Method.java:606)
	at org.junit.runners.model.FrameworkMethod$1.runReflectiveCall(FrameworkMethod.java:47)
	at org.junit.internal.runners.model.ReflectiveCallable.run(ReflectiveCallable.java:12)
	at org.junit.runners.model.FrameworkMethod.invokeExplosively(FrameworkMethod.java:44)
	at org.junit.internal.runners.statements.RunBefores.evaluate(RunBefores.java:24)
	at org.junit.internal.runners.statements.RunAfters.evaluate(RunAfters.java:27)
	at org.junit.runners.ParentRunner.runLeaf(ParentRunner.java:271)
	at org.junit.runners.BlockJUnit4ClassRunner.runChild(BlockJUnit4ClassRunner.java:70)
	at org.junit.runners.BlockJUnit4ClassRunner.runChild(BlockJUnit4ClassRunner.java:50)
	at org.junit.runners.ParentRunner$3.run(ParentRunner.java:238)
	at org.junit.runners.ParentRunner$1.schedule(ParentRunner.java:63)
	at org.junit.runners.ParentRunner.runChildren(ParentRunner.java:236)
	at org.junit.runners.ParentRunner.access$000(ParentRunner.java:53)
	at org.junit.runners.ParentRunner$2.evaluate(ParentRunner.java:229)
	at org.junit.runners.ParentRunner.run(ParentRunner.java:309)
	at org.junit.runners.Suite.runChild(Suite.java:127)
	at org.junit.runners.Suite.runChild(Suite.java:26)
	at org.junit.runners.ParentRunner$3.run(ParentRunner.java:238)
	at org.junit.runners.ParentRunner$1.schedule(ParentRunner.java:63)
	at org.junit.runners.ParentRunner.runChildren(ParentRunner.java:236)
	at org.junit.runners.ParentRunner.access$000(ParentRunner.java:53)
	at org.junit.runners.ParentRunner$2.evaluate(ParentRunner.java:229)
	at org.junit.runners.ParentRunner.run(ParentRunner.java:309)
	at org.apache.maven.surefire.junit4.JUnit4Provider.execute(JUnit4Provider.java:264)
	at org.apache.maven.surefire.junit4.JUnit4Provider.executeTestSet(JUnit4Provider.java:153)
	at org.apache.maven.surefire.junit4.JUnit4Provider.invoke(JUnit4Provider.java:124)
	at org.apache.maven.surefire.booter.ForkedBooter.invokeProviderInSameClassLoader(ForkedBooter.java:200)
	at org.apache.maven.surefire.booter.ForkedBooter.runSuitesInProcess(ForkedBooter.java:153)
	at org.apache.maven.surefire.booter.ForkedBooter.main(ForkedBooter.java:103)


REGRESSION:  org.apache.hadoop.yarn.server.resourcemanager.TestRMRestart.testAppRecoveredInOrderOnRMRestart[1]

Error Message:
org.xml.sax.SAXParseException; systemId: jar:file:/home/jenkins/.m2/repository/org/apache/hadoop/hadoop-common/3.0.0-SNAPSHOT/hadoop-common-3.0.0-SNAPSHOT.jar!/core-default.xml; lineNumber: 1; columnNumber: 1; Invalid byte 1 of 1-byte UTF-8 sequence.

Stack Trace:
java.lang.RuntimeException: org.xml.sax.SAXParseException; systemId: jar:file:/home/jenkins/.m2/repository/org/apache/hadoop/hadoop-common/3.0.0-SNAPSHOT/hadoop-common-3.0.0-SNAPSHOT.jar!/core-default.xml; lineNumber: 1; columnNumber: 1; Invalid byte 1 of 1-byte UTF-8 sequence.
	at org.apache.hadoop.conf.Configuration.loadResource(Configuration.java:2728)
	at org.apache.hadoop.conf.Configuration.loadResources(Configuration.java:2560)
	at org.apache.hadoop.conf.Configuration.getProps(Configuration.java:2471)
	at org.apache.hadoop.conf.Configuration.set(Configuration.java:1207)
	at org.apache.hadoop.conf.Configuration.set(Configuration.java:1179)
	at org.apache.hadoop.yarn.server.resourcemanager.ParameterizedSchedulerTestBase.configureFairScheduler(ParameterizedSchedulerTestBase.java:97)
	at org.apache.hadoop.yarn.server.resourcemanager.ParameterizedSchedulerTestBase.configureScheduler(ParameterizedSchedulerTestBase.java:75)
	at sun.reflect.GeneratedMethodAccessor62.invoke(Unknown Source)
	at sun.reflect.DelegatingMethodAccessorImpl.invoke(DelegatingMethodAccessorImpl.java:43)
	at java.lang.reflect.Method.invoke(Method.java:606)
	at org.junit.runners.model.FrameworkMethod$1.runReflectiveCall(FrameworkMethod.java:47)
	at org.junit.internal.runners.model.ReflectiveCallable.run(ReflectiveCallable.java:12)
	at org.junit.runners.model.FrameworkMethod.invokeExplosively(FrameworkMethod.java:44)
	at org.junit.internal.runners.statements.RunBefores.evaluate(RunBefores.java:24)
	at org.junit.internal.runners.statements.RunAfters.evaluate(RunAfters.java:27)
	at org.junit.runners.ParentRunner.runLeaf(ParentRunner.java:271)
	at org.junit.runners.BlockJUnit4ClassRunner.runChild(BlockJUnit4ClassRunner.java:70)
	at org.junit.runners.BlockJUnit4ClassRunner.runChild(BlockJUnit4ClassRunner.java:50)
	at org.junit.runners.ParentRunner$3.run(ParentRunner.java:238)
	at org.junit.runners.ParentRunner$1.schedule(ParentRunner.java:63)
	at org.junit.runners.ParentRunner.runChildren(ParentRunner.java:236)
	at org.junit.runners.ParentRunner.access$000(ParentRunner.java:53)
	at org.junit.runners.ParentRunner$2.evaluate(ParentRunner.java:229)
	at org.junit.runners.ParentRunner.run(ParentRunner.java:309)
	at org.junit.runners.Suite.runChild(Suite.java:127)
	at org.junit.runners.Suite.runChild(Suite.java:26)
	at org.junit.runners.ParentRunner$3.run(ParentRunner.java:238)
	at org.junit.runners.ParentRunner$1.schedule(ParentRunner.java:63)
	at org.junit.runners.ParentRunner.runChildren(ParentRunner.java:236)
	at org.junit.runners.ParentRunner.access$000(ParentRunner.java:53)
	at org.junit.runners.ParentRunner$2.evaluate(ParentRunner.java:229)
	at org.junit.runners.ParentRunner.run(ParentRunner.java:309)
	at org.apache.maven.surefire.junit4.JUnit4Provider.execute(JUnit4Provider.java:264)
	at org.apache.maven.surefire.junit4.JUnit4Provider.executeTestSet(JUnit4Provider.java:153)
	at org.apache.maven.surefire.junit4.JUnit4Provider.invoke(JUnit4Provider.java:124)
	at org.apache.maven.surefire.booter.ForkedBooter.invokeProviderInSameClassLoader(ForkedBooter.java:200)
	at org.apache.maven.surefire.booter.ForkedBooter.runSuitesInProcess(ForkedBooter.java:153)
	at org.apache.maven.surefire.booter.ForkedBooter.main(ForkedBooter.java:103)
Caused by: org.xml.sax.SAXParseException: Invalid byte 1 of 1-byte UTF-8 sequence.
	at org.apache.xerces.parsers.DOMParser.parse(Unknown Source)
	at org.apache.xerces.jaxp.DocumentBuilderImpl.parse(Unknown Source)
	at javax.xml.parsers.DocumentBuilder.parse(DocumentBuilder.java:150)
	at org.apache.hadoop.conf.Configuration.parse(Configuration.java:2548)
	at org.apache.hadoop.conf.Configuration.parse(Configuration.java:2536)
	at org.apache.hadoop.conf.Configuration.loadResource(Configuration.java:2607)
	at org.apache.hadoop.conf.Configuration.loadResources(Configuration.java:2560)
	at org.apache.hadoop.conf.Configuration.getProps(Configuration.java:2471)
	at org.apache.hadoop.conf.Configuration.set(Configuration.java:1207)
	at org.apache.hadoop.conf.Configuration.set(Configuration.java:1179)
	at org.apache.hadoop.yarn.server.resourcemanager.ParameterizedSchedulerTestBase.configureFairScheduler(ParameterizedSchedulerTestBase.java:97)
	at org.apache.hadoop.yarn.server.resourcemanager.ParameterizedSchedulerTestBase.configureScheduler(ParameterizedSchedulerTestBase.java:75)
	at sun.reflect.GeneratedMethodAccessor62.invoke(Unknown Source)
	at sun.reflect.DelegatingMethodAccessorImpl.invoke(DelegatingMethodAccessorImpl.java:43)
	at java.lang.reflect.Method.invoke(Method.java:606)
	at org.junit.runners.model.FrameworkMethod$1.runReflectiveCall(FrameworkMethod.java:47)
	at org.junit.internal.runners.model.ReflectiveCallable.run(ReflectiveCallable.java:12)
	at org.junit.runners.model.FrameworkMethod.invokeExplosively(FrameworkMethod.java:44)
	at org.junit.internal.runners.statements.RunBefores.evaluate(RunBefores.java:24)
	at org.junit.internal.runners.statements.RunAfters.evaluate(RunAfters.java:27)
	at org.junit.runners.ParentRunner.runLeaf(ParentRunner.java:271)
	at org.junit.runners.BlockJUnit4ClassRunner.runChild(BlockJUnit4ClassRunner.java:70)
	at org.junit.runners.BlockJUnit4ClassRunner.runChild(BlockJUnit4ClassRunner.java:50)
	at org.junit.runners.ParentRunner$3.run(ParentRunner.java:238)
	at org.junit.runners.ParentRunner$1.schedule(ParentRunner.java:63)
	at org.junit.runners.ParentRunner.runChildren(ParentRunner.java:236)
	at org.junit.runners.ParentRunner.access$000(ParentRunner.java:53)
	at org.junit.runners.ParentRunner$2.evaluate(ParentRunner.java:229)
	at org.junit.runners.ParentRunner.run(ParentRunner.java:309)
	at org.junit.runners.Suite.runChild(Suite.java:127)
	at org.junit.runners.Suite.runChild(Suite.java:26)
	at org.junit.runners.ParentRunner$3.run(ParentRunner.java:238)
	at org.junit.runners.ParentRunner$1.schedule(ParentRunner.java:63)
	at org.junit.runners.ParentRunner.runChildren(ParentRunner.java:236)
	at org.junit.runners.ParentRunner.access$000(ParentRunner.java:53)
	at org.junit.runners.ParentRunner$2.evaluate(ParentRunner.java:229)
	at org.junit.runners.ParentRunner.run(ParentRunner.java:309)
	at org.apache.maven.surefire.junit4.JUnit4Provider.execute(JUnit4Provider.java:264)
	at org.apache.maven.surefire.junit4.JUnit4Provider.executeTestSet(JUnit4Provider.java:153)
	at org.apache.maven.surefire.junit4.JUnit4Provider.invoke(JUnit4Provider.java:124)
	at org.apache.maven.surefire.booter.ForkedBooter.invokeProviderInSameClassLoader(ForkedBooter.java:200)
	at org.apache.maven.surefire.booter.ForkedBooter.runSuitesInProcess(ForkedBooter.java:153)
	at org.apache.maven.surefire.booter.ForkedBooter.main(ForkedBooter.java:103)
Caused by: org.apache.xerces.impl.io.MalformedByteSequenceException: Invalid byte 1 of 1-byte UTF-8 sequence.
	at org.apache.xerces.impl.io.UTF8Reader.invalidByte(Unknown Source)
	at org.apache.xerces.impl.io.UTF8Reader.read(Unknown Source)
	at org.apache.xerces.impl.XMLEntityScanner.load(Unknown Source)
	at org.apache.xerces.impl.XMLEntityScanner.skipString(Unknown Source)
	at org.apache.xerces.impl.XMLVersionDetector.determineDocVersion(Unknown Source)
	at org.apache.xerces.parsers.XML11Configuration.parse(Unknown Source)
	at org.apache.xerces.parsers.XML11Configuration.parse(Unknown Source)
	at org.apache.xerces.parsers.XMLParser.parse(Unknown Source)
	at org.apache.xerces.parsers.DOMParser.parse(Unknown Source)
	at org.apache.xerces.jaxp.DocumentBuilderImpl.parse(Unknown Source)
	at javax.xml.parsers.DocumentBuilder.parse(DocumentBuilder.java:150)
	at org.apache.hadoop.conf.Configuration.parse(Configuration.java:2548)
	at org.apache.hadoop.conf.Configuration.parse(Configuration.java:2536)
	at org.apache.hadoop.conf.Configuration.loadResource(Configuration.java:2607)
	at org.apache.hadoop.conf.Configuration.loadResources(Configuration.java:2560)
	at org.apache.hadoop.conf.Configuration.getProps(Configuration.java:2471)
	at org.apache.hadoop.conf.Configuration.set(Configuration.java:1207)
	at org.apache.hadoop.conf.Configuration.set(Configuration.java:1179)
	at org.apache.hadoop.yarn.server.resourcemanager.ParameterizedSchedulerTestBase.configureFairScheduler(ParameterizedSchedulerTestBase.java:97)
	at org.apache.hadoop.yarn.server.resourcemanager.ParameterizedSchedulerTestBase.configureScheduler(ParameterizedSchedulerTestBase.java:75)
	at sun.reflect.GeneratedMethodAccessor62.invoke(Unknown Source)
	at sun.reflect.DelegatingMethodAccessorImpl.invoke(DelegatingMethodAccessorImpl.java:43)
	at java.lang.reflect.Method.invoke(Method.java:606)
	at org.junit.runners.model.FrameworkMethod$1.runReflectiveCall(FrameworkMethod.java:47)
	at org.junit.internal.runners.model.ReflectiveCallable.run(ReflectiveCallable.java:12)
	at org.junit.runners.model.FrameworkMethod.invokeExplosively(FrameworkMethod.java:44)
	at org.junit.internal.runners.statements.RunBefores.evaluate(RunBefores.java:24)
	at org.junit.internal.runners.statements.RunAfters.evaluate(RunAfters.java:27)
	at org.junit.runners.ParentRunner.runLeaf(ParentRunner.java:271)
	at org.junit.runners.BlockJUnit4ClassRunner.runChild(BlockJUnit4ClassRunner.java:70)
	at org.junit.runners.BlockJUnit4ClassRunner.runChild(BlockJUnit4ClassRunner.java:50)
	at org.junit.runners.ParentRunner$3.run(ParentRunner.java:238)
	at org.junit.runners.ParentRunner$1.schedule(ParentRunner.java:63)
	at org.junit.runners.ParentRunner.runChildren(ParentRunner.java:236)
	at org.junit.runners.ParentRunner.access$000(ParentRunner.java:53)
	at org.junit.runners.ParentRunner$2.evaluate(ParentRunner.java:229)
	at org.junit.runners.ParentRunner.run(ParentRunner.java:309)
	at org.junit.runners.Suite.runChild(Suite.java:127)
	at org.junit.runners.Suite.runChild(Suite.java:26)
	at org.junit.runners.ParentRunner$3.run(ParentRunner.java:238)
	at org.junit.runners.ParentRunner$1.schedule(ParentRunner.java:63)
	at org.junit.runners.ParentRunner.runChildren(ParentRunner.java:236)
	at org.junit.runners.ParentRunner.access$000(ParentRunner.java:53)
	at org.junit.runners.ParentRunner$2.evaluate(ParentRunner.java:229)
	at org.junit.runners.ParentRunner.run(ParentRunner.java:309)
	at org.apache.maven.surefire.junit4.JUnit4Provider.execute(JUnit4Provider.java:264)
	at org.apache.maven.surefire.junit4.JUnit4Provider.executeTestSet(JUnit4Provider.java:153)
	at org.apache.maven.surefire.junit4.JUnit4Provider.invoke(JUnit4Provider.java:124)
	at org.apache.maven.surefire.booter.ForkedBooter.invokeProviderInSameClassLoader(ForkedBooter.java:200)
	at org.apache.maven.surefire.booter.ForkedBooter.runSuitesInProcess(ForkedBooter.java:153)
	at org.apache.maven.surefire.booter.ForkedBooter.main(ForkedBooter.java:103)


REGRESSION:  org.apache.hadoop.yarn.server.resourcemanager.TestRMRestart.testRMShutdown[1]

Error Message:
org.xml.sax.SAXParseException; systemId: jar:file:/home/jenkins/.m2/repository/org/apache/hadoop/hadoop-common/3.0.0-SNAPSHOT/hadoop-common-3.0.0-SNAPSHOT.jar!/core-default.xml; lineNumber: 1; columnNumber: 1; Invalid byte 1 of 1-byte UTF-8 sequence.

Stack Trace:
java.lang.RuntimeException: org.xml.sax.SAXParseException; systemId: jar:file:/home/jenkins/.m2/repository/org/apache/hadoop/hadoop-common/3.0.0-SNAPSHOT/hadoop-common-3.0.0-SNAPSHOT.jar!/core-default.xml; lineNumber: 1; columnNumber: 1; Invalid byte 1 of 1-byte UTF-8 sequence.
	at org.apache.hadoop.conf.Configuration.loadResource(Configuration.java:2728)
	at org.apache.hadoop.conf.Configuration.loadResources(Configuration.java:2560)
	at org.apache.hadoop.conf.Configuration.getProps(Configuration.java:2471)
	at org.apache.hadoop.conf.Configuration.set(Configuration.java:1207)
	at org.apache.hadoop.conf.Configuration.set(Configuration.java:1179)
	at org.apache.hadoop.yarn.server.resourcemanager.ParameterizedSchedulerTestBase.configureFairScheduler(ParameterizedSchedulerTestBase.java:97)
	at org.apache.hadoop.yarn.server.resourcemanager.ParameterizedSchedulerTestBase.configureScheduler(ParameterizedSchedulerTestBase.java:75)
	at sun.reflect.GeneratedMethodAccessor62.invoke(Unknown Source)
	at sun.reflect.DelegatingMethodAccessorImpl.invoke(DelegatingMethodAccessorImpl.java:43)
	at java.lang.reflect.Method.invoke(Method.java:606)
	at org.junit.runners.model.FrameworkMethod$1.runReflectiveCall(FrameworkMethod.java:47)
	at org.junit.internal.runners.model.ReflectiveCallable.run(ReflectiveCallable.java:12)
	at org.junit.runners.model.FrameworkMethod.invokeExplosively(FrameworkMethod.java:44)
	at org.junit.internal.runners.statements.RunBefores.evaluate(RunBefores.java:24)
	at org.junit.internal.runners.statements.RunAfters.evaluate(RunAfters.java:27)
	at org.junit.runners.ParentRunner.runLeaf(ParentRunner.java:271)
	at org.junit.runners.BlockJUnit4ClassRunner.runChild(BlockJUnit4ClassRunner.java:70)
	at org.junit.runners.BlockJUnit4ClassRunner.runChild(BlockJUnit4ClassRunner.java:50)
	at org.junit.runners.ParentRunner$3.run(ParentRunner.java:238)
	at org.junit.runners.ParentRunner$1.schedule(ParentRunner.java:63)
	at org.junit.runners.ParentRunner.runChildren(ParentRunner.java:236)
	at org.junit.runners.ParentRunner.access$000(ParentRunner.java:53)
	at org.junit.runners.ParentRunner$2.evaluate(ParentRunner.java:229)
	at org.junit.runners.ParentRunner.run(ParentRunner.java:309)
	at org.junit.runners.Suite.runChild(Suite.java:127)
	at org.junit.runners.Suite.runChild(Suite.java:26)
	at org.junit.runners.ParentRunner$3.run(ParentRunner.java:238)
	at org.junit.runners.ParentRunner$1.schedule(ParentRunner.java:63)
	at org.junit.runners.ParentRunner.runChildren(ParentRunner.java:236)
	at org.junit.runners.ParentRunner.access$000(ParentRunner.java:53)
	at org.junit.runners.ParentRunner$2.evaluate(ParentRunner.java:229)
	at org.junit.runners.ParentRunner.run(ParentRunner.java:309)
	at org.apache.maven.surefire.junit4.JUnit4Provider.execute(JUnit4Provider.java:264)
	at org.apache.maven.surefire.junit4.JUnit4Provider.executeTestSet(JUnit4Provider.java:153)
	at org.apache.maven.surefire.junit4.JUnit4Provider.invoke(JUnit4Provider.java:124)
	at org.apache.maven.surefire.booter.ForkedBooter.invokeProviderInSameClassLoader(ForkedBooter.java:200)
	at org.apache.maven.surefire.booter.ForkedBooter.runSuitesInProcess(ForkedBooter.java:153)
	at org.apache.maven.surefire.booter.ForkedBooter.main(ForkedBooter.java:103)
Caused by: org.xml.sax.SAXParseException: Invalid byte 1 of 1-byte UTF-8 sequence.
	at org.apache.xerces.parsers.DOMParser.parse(Unknown Source)
	at org.apache.xerces.jaxp.DocumentBuilderImpl.parse(Unknown Source)
	at javax.xml.parsers.DocumentBuilder.parse(DocumentBuilder.java:150)
	at org.apache.hadoop.conf.Configuration.parse(Configuration.java:2548)
	at org.apache.hadoop.conf.Configuration.parse(Configuration.java:2536)
	at org.apache.hadoop.conf.Configuration.loadResource(Configuration.java:2607)
	at org.apache.hadoop.conf.Configuration.loadResources(Configuration.java:2560)
	at org.apache.hadoop.conf.Configuration.getProps(Configuration.java:2471)
	at org.apache.hadoop.conf.Configuration.set(Configuration.java:1207)
	at org.apache.hadoop.conf.Configuration.set(Configuration.java:1179)
	at org.apache.hadoop.yarn.server.resourcemanager.ParameterizedSchedulerTestBase.configureFairScheduler(ParameterizedSchedulerTestBase.java:97)
	at org.apache.hadoop.yarn.server.resourcemanager.ParameterizedSchedulerTestBase.configureScheduler(ParameterizedSchedulerTestBase.java:75)
	at sun.reflect.GeneratedMethodAccessor62.invoke(Unknown Source)
	at sun.reflect.DelegatingMethodAccessorImpl.invoke(DelegatingMethodAccessorImpl.java:43)
	at java.lang.reflect.Method.invoke(Method.java:606)
	at org.junit.runners.model.FrameworkMethod$1.runReflectiveCall(FrameworkMethod.java:47)
	at org.junit.internal.runners.model.ReflectiveCallable.run(ReflectiveCallable.java:12)
	at org.junit.runners.model.FrameworkMethod.invokeExplosively(FrameworkMethod.java:44)
	at org.junit.internal.runners.statements.RunBefores.evaluate(RunBefores.java:24)
	at org.junit.internal.runners.statements.RunAfters.evaluate(RunAfters.java:27)
	at org.junit.runners.ParentRunner.runLeaf(ParentRunner.java:271)
	at org.junit.runners.BlockJUnit4ClassRunner.runChild(BlockJUnit4ClassRunner.java:70)
	at org.junit.runners.BlockJUnit4ClassRunner.runChild(BlockJUnit4ClassRunner.java:50)
	at org.junit.runners.ParentRunner$3.run(ParentRunner.java:238)
	at org.junit.runners.ParentRunner$1.schedule(ParentRunner.java:63)
	at org.junit.runners.ParentRunner.runChildren(ParentRunner.java:236)
	at org.junit.runners.ParentRunner.access$000(ParentRunner.java:53)
	at org.junit.runners.ParentRunner$2.evaluate(ParentRunner.java:229)
	at org.junit.runners.ParentRunner.run(ParentRunner.java:309)
	at org.junit.runners.Suite.runChild(Suite.java:127)
	at org.junit.runners.Suite.runChild(Suite.java:26)
	at org.junit.runners.ParentRunner$3.run(ParentRunner.java:238)
	at org.junit.runners.ParentRunner$1.schedule(ParentRunner.java:63)
	at org.junit.runners.ParentRunner.runChildren(ParentRunner.java:236)
	at org.junit.runners.ParentRunner.access$000(ParentRunner.java:53)
	at org.junit.runners.ParentRunner$2.evaluate(ParentRunner.java:229)
	at org.junit.runners.ParentRunner.run(ParentRunner.java:309)
	at org.apache.maven.surefire.junit4.JUnit4Provider.execute(JUnit4Provider.java:264)
	at org.apache.maven.surefire.junit4.JUnit4Provider.executeTestSet(JUnit4Provider.java:153)
	at org.apache.maven.surefire.junit4.JUnit4Provider.invoke(JUnit4Provider.java:124)
	at org.apache.maven.surefire.booter.ForkedBooter.invokeProviderInSameClassLoader(ForkedBooter.java:200)
	at org.apache.maven.surefire.booter.ForkedBooter.runSuitesInProcess(ForkedBooter.java:153)
	at org.apache.maven.surefire.booter.ForkedBooter.main(ForkedBooter.java:103)
Caused by: org.apache.xerces.impl.io.MalformedByteSequenceException: Invalid byte 1 of 1-byte UTF-8 sequence.
	at org.apache.xerces.impl.io.UTF8Reader.invalidByte(Unknown Source)
	at org.apache.xerces.impl.io.UTF8Reader.read(Unknown Source)
	at org.apache.xerces.impl.XMLEntityScanner.load(Unknown Source)
	at org.apache.xerces.impl.XMLEntityScanner.skipString(Unknown Source)
	at org.apache.xerces.impl.XMLVersionDetector.determineDocVersion(Unknown Source)
	at org.apache.xerces.parsers.XML11Configuration.parse(Unknown Source)
	at org.apache.xerces.parsers.XML11Configuration.parse(Unknown Source)
	at org.apache.xerces.parsers.XMLParser.parse(Unknown Source)
	at org.apache.xerces.parsers.DOMParser.parse(Unknown Source)
	at org.apache.xerces.jaxp.DocumentBuilderImpl.parse(Unknown Source)
	at javax.xml.parsers.DocumentBuilder.parse(DocumentBuilder.java:150)
	at org.apache.hadoop.conf.Configuration.parse(Configuration.java:2548)
	at org.apache.hadoop.conf.Configuration.parse(Configuration.java:2536)
	at org.apache.hadoop.conf.Configuration.loadResource(Configuration.java:2607)
	at org.apache.hadoop.conf.Configuration.loadResources(Configuration.java:2560)
	at org.apache.hadoop.conf.Configuration.getProps(Configuration.java:2471)
	at org.apache.hadoop.conf.Configuration.set(Configuration.java:1207)
	at org.apache.hadoop.conf.Configuration.set(Configuration.java:1179)
	at org.apache.hadoop.yarn.server.resourcemanager.ParameterizedSchedulerTestBase.configureFairScheduler(ParameterizedSchedulerTestBase.java:97)
	at org.apache.hadoop.yarn.server.resourcemanager.ParameterizedSchedulerTestBase.configureScheduler(ParameterizedSchedulerTestBase.java:75)
	at sun.reflect.GeneratedMethodAccessor62.invoke(Unknown Source)
	at sun.reflect.DelegatingMethodAccessorImpl.invoke(DelegatingMethodAccessorImpl.java:43)
	at java.lang.reflect.Method.invoke(Method.java:606)
	at org.junit.runners.model.FrameworkMethod$1.runReflectiveCall(FrameworkMethod.java:47)
	at org.junit.internal.runners.model.ReflectiveCallable.run(ReflectiveCallable.java:12)
	at org.junit.runners.model.FrameworkMethod.invokeExplosively(FrameworkMethod.java:44)
	at org.junit.internal.runners.statements.RunBefores.evaluate(RunBefores.java:24)
	at org.junit.internal.runners.statements.RunAfters.evaluate(RunAfters.java:27)
	at org.junit.runners.ParentRunner.runLeaf(ParentRunner.java:271)
	at org.junit.runners.BlockJUnit4ClassRunner.runChild(BlockJUnit4ClassRunner.java:70)
	at org.junit.runners.BlockJUnit4ClassRunner.runChild(BlockJUnit4ClassRunner.java:50)
	at org.junit.runners.ParentRunner$3.run(ParentRunner.java:238)
	at org.junit.runners.ParentRunner$1.schedule(ParentRunner.java:63)
	at org.junit.runners.ParentRunner.runChildren(ParentRunner.java:236)
	at org.junit.runners.ParentRunner.access$000(ParentRunner.java:53)
	at org.junit.runners.ParentRunner$2.evaluate(ParentRunner.java:229)
	at org.junit.runners.ParentRunner.run(ParentRunner.java:309)
	at org.junit.runners.Suite.runChild(Suite.java:127)
	at org.junit.runners.Suite.runChild(Suite.java:26)
	at org.junit.runners.ParentRunner$3.run(ParentRunner.java:238)
	at org.junit.runners.ParentRunner$1.schedule(ParentRunner.java:63)
	at org.junit.runners.ParentRunner.runChildren(ParentRunner.java:236)
	at org.junit.runners.ParentRunner.access$000(ParentRunner.java:53)
	at org.junit.runners.ParentRunner$2.evaluate(ParentRunner.java:229)
	at org.junit.runners.ParentRunner.run(ParentRunner.java:309)
	at org.apache.maven.surefire.junit4.JUnit4Provider.execute(JUnit4Provider.java:264)
	at org.apache.maven.surefire.junit4.JUnit4Provider.executeTestSet(JUnit4Provider.java:153)
	at org.apache.maven.surefire.junit4.JUnit4Provider.invoke(JUnit4Provider.java:124)
	at org.apache.maven.surefire.booter.ForkedBooter.invokeProviderInSameClassLoader(ForkedBooter.java:200)
	at org.apache.maven.surefire.booter.ForkedBooter.runSuitesInProcess(ForkedBooter.java:153)
	at org.apache.maven.surefire.booter.ForkedBooter.main(ForkedBooter.java:103)


REGRESSION:  org.apache.hadoop.yarn.server.resourcemanager.TestRMRestart.testSynchronouslyRenewDTOnRecovery[1]

Error Message:
org.xml.sax.SAXParseException; systemId: jar:file:/home/jenkins/.m2/repository/org/apache/hadoop/hadoop-common/3.0.0-SNAPSHOT/hadoop-common-3.0.0-SNAPSHOT.jar!/core-default.xml; lineNumber: 1; columnNumber: 1; Invalid byte 1 of 1-byte UTF-8 sequence.

Stack Trace:
java.lang.RuntimeException: org.xml.sax.SAXParseException; systemId: jar:file:/home/jenkins/.m2/repository/org/apache/hadoop/hadoop-common/3.0.0-SNAPSHOT/hadoop-common-3.0.0-SNAPSHOT.jar!/core-default.xml; lineNumber: 1; columnNumber: 1; Invalid byte 1 of 1-byte UTF-8 sequence.
	at org.apache.hadoop.conf.Configuration.loadResource(Configuration.java:2728)
	at org.apache.hadoop.conf.Configuration.loadResources(Configuration.java:2560)
	at org.apache.hadoop.conf.Configuration.getProps(Configuration.java:2471)
	at org.apache.hadoop.conf.Configuration.set(Configuration.java:1207)
	at org.apache.hadoop.conf.Configuration.set(Configuration.java:1179)
	at org.apache.hadoop.yarn.server.resourcemanager.ParameterizedSchedulerTestBase.configureFairScheduler(ParameterizedSchedulerTestBase.java:97)
	at org.apache.hadoop.yarn.server.resourcemanager.ParameterizedSchedulerTestBase.configureScheduler(ParameterizedSchedulerTestBase.java:75)
	at sun.reflect.GeneratedMethodAccessor62.invoke(Unknown Source)
	at sun.reflect.DelegatingMethodAccessorImpl.invoke(DelegatingMethodAccessorImpl.java:43)
	at java.lang.reflect.Method.invoke(Method.java:606)
	at org.junit.runners.model.FrameworkMethod$1.runReflectiveCall(FrameworkMethod.java:47)
	at org.junit.internal.runners.model.ReflectiveCallable.run(ReflectiveCallable.java:12)
	at org.junit.runners.model.FrameworkMethod.invokeExplosively(FrameworkMethod.java:44)
	at org.junit.internal.runners.statements.RunBefores.evaluate(RunBefores.java:24)
	at org.junit.internal.runners.statements.RunAfters.evaluate(RunAfters.java:27)
	at org.junit.runners.ParentRunner.runLeaf(ParentRunner.java:271)
	at org.junit.runners.BlockJUnit4ClassRunner.runChild(BlockJUnit4ClassRunner.java:70)
	at org.junit.runners.BlockJUnit4ClassRunner.runChild(BlockJUnit4ClassRunner.java:50)
	at org.junit.runners.ParentRunner$3.run(ParentRunner.java:238)
	at org.junit.runners.ParentRunner$1.schedule(ParentRunner.java:63)
	at org.junit.runners.ParentRunner.runChildren(ParentRunner.java:236)
	at org.junit.runners.ParentRunner.access$000(ParentRunner.java:53)
	at org.junit.runners.ParentRunner$2.evaluate(ParentRunner.java:229)
	at org.junit.runners.ParentRunner.run(ParentRunner.java:309)
	at org.junit.runners.Suite.runChild(Suite.java:127)
	at org.junit.runners.Suite.runChild(Suite.java:26)
	at org.junit.runners.ParentRunner$3.run(ParentRunner.java:238)
	at org.junit.runners.ParentRunner$1.schedule(ParentRunner.java:63)
	at org.junit.runners.ParentRunner.runChildren(ParentRunner.java:236)
	at org.junit.runners.ParentRunner.access$000(ParentRunner.java:53)
	at org.junit.runners.ParentRunner$2.evaluate(ParentRunner.java:229)
	at org.junit.runners.ParentRunner.run(ParentRunner.java:309)
	at org.apache.maven.surefire.junit4.JUnit4Provider.execute(JUnit4Provider.java:264)
	at org.apache.maven.surefire.junit4.JUnit4Provider.executeTestSet(JUnit4Provider.java:153)
	at org.apache.maven.surefire.junit4.JUnit4Provider.invoke(JUnit4Provider.java:124)
	at org.apache.maven.surefire.booter.ForkedBooter.invokeProviderInSameClassLoader(ForkedBooter.java:200)
	at org.apache.maven.surefire.booter.ForkedBooter.runSuitesInProcess(ForkedBooter.java:153)
	at org.apache.maven.surefire.booter.ForkedBooter.main(ForkedBooter.java:103)
Caused by: org.xml.sax.SAXParseException: Invalid byte 1 of 1-byte UTF-8 sequence.
	at org.apache.xerces.parsers.DOMParser.parse(Unknown Source)
	at org.apache.xerces.jaxp.DocumentBuilderImpl.parse(Unknown Source)
	at javax.xml.parsers.DocumentBuilder.parse(DocumentBuilder.java:150)
	at org.apache.hadoop.conf.Configuration.parse(Configuration.java:2548)
	at org.apache.hadoop.conf.Configuration.parse(Configuration.java:2536)
	at org.apache.hadoop.conf.Configuration.loadResource(Configuration.java:2607)
	at org.apache.hadoop.conf.Configuration.loadResources(Configuration.java:2560)
	at org.apache.hadoop.conf.Configuration.getProps(Configuration.java:2471)
	at org.apache.hadoop.conf.Configuration.set(Configuration.java:1207)
	at org.apache.hadoop.conf.Configuration.set(Configuration.java:1179)
	at org.apache.hadoop.yarn.server.resourcemanager.ParameterizedSchedulerTestBase.configureFairScheduler(ParameterizedSchedulerTestBase.java:97)
	at org.apache.hadoop.yarn.server.resourcemanager.ParameterizedSchedulerTestBase.configureScheduler(ParameterizedSchedulerTestBase.java:75)
	at sun.reflect.GeneratedMethodAccessor62.invoke(Unknown Source)
	at sun.reflect.DelegatingMethodAccessorImpl.invoke(DelegatingMethodAccessorImpl.java:43)
	at java.lang.reflect.Method.invoke(Method.java:606)
	at org.junit.runners.model.FrameworkMethod$1.runReflectiveCall(FrameworkMethod.java:47)
	at org.junit.internal.runners.model.ReflectiveCallable.run(ReflectiveCallable.java:12)
	at org.junit.runners.model.FrameworkMethod.invokeExplosively(FrameworkMethod.java:44)
	at org.junit.internal.runners.statements.RunBefores.evaluate(RunBefores.java:24)
	at org.junit.internal.runners.statements.RunAfters.evaluate(RunAfters.java:27)
	at org.junit.runners.ParentRunner.runLeaf(ParentRunner.java:271)
	at org.junit.runners.BlockJUnit4ClassRunner.runChild(BlockJUnit4ClassRunner.java:70)
	at org.junit.runners.BlockJUnit4ClassRunner.runChild(BlockJUnit4ClassRunner.java:50)
	at org.junit.runners.ParentRunner$3.run(ParentRunner.java:238)
	at org.junit.runners.ParentRunner$1.schedule(ParentRunner.java:63)
	at org.junit.runners.ParentRunner.runChildren(ParentRunner.java:236)
	at org.junit.runners.ParentRunner.access$000(ParentRunner.java:53)
	at org.junit.runners.ParentRunner$2.evaluate(ParentRunner.java:229)
	at org.junit.runners.ParentRunner.run(ParentRunner.java:309)
	at org.junit.runners.Suite.runChild(Suite.java:127)
	at org.junit.runners.Suite.runChild(Suite.java:26)
	at org.junit.runners.ParentRunner$3.run(ParentRunner.java:238)
	at org.junit.runners.ParentRunner$1.schedule(ParentRunner.java:63)
	at org.junit.runners.ParentRunner.runChildren(ParentRunner.java:236)
	at org.junit.runners.ParentRunner.access$000(ParentRunner.java:53)
	at org.junit.runners.ParentRunner$2.evaluate(ParentRunner.java:229)
	at org.junit.runners.ParentRunner.run(ParentRunner.java:309)
	at org.apache.maven.surefire.junit4.JUnit4Provider.execute(JUnit4Provider.java:264)
	at org.apache.maven.surefire.junit4.JUnit4Provider.executeTestSet(JUnit4Provider.java:153)
	at org.apache.maven.surefire.junit4.JUnit4Provider.invoke(JUnit4Provider.java:124)
	at org.apache.maven.surefire.booter.ForkedBooter.invokeProviderInSameClassLoader(ForkedBooter.java:200)
	at org.apache.maven.surefire.booter.ForkedBooter.runSuitesInProcess(ForkedBooter.java:153)
	at org.apache.maven.surefire.booter.ForkedBooter.main(ForkedBooter.java:103)
Caused by: org.apache.xerces.impl.io.MalformedByteSequenceException: Invalid byte 1 of 1-byte UTF-8 sequence.
	at org.apache.xerces.impl.io.UTF8Reader.invalidByte(Unknown Source)
	at org.apache.xerces.impl.io.UTF8Reader.read(Unknown Source)
	at org.apache.xerces.impl.XMLEntityScanner.load(Unknown Source)
	at org.apache.xerces.impl.XMLEntityScanner.skipString(Unknown Source)
	at org.apache.xerces.impl.XMLVersionDetector.determineDocVersion(Unknown Source)
	at org.apache.xerces.parsers.XML11Configuration.parse(Unknown Source)
	at org.apache.xerces.parsers.XML11Configuration.parse(Unknown Source)
	at org.apache.xerces.parsers.XMLParser.parse(Unknown Source)
	at org.apache.xerces.parsers.DOMParser.parse(Unknown Source)
	at org.apache.xerces.jaxp.DocumentBuilderImpl.parse(Unknown Source)
	at javax.xml.parsers.DocumentBuilder.parse(DocumentBuilder.java:150)
	at org.apache.hadoop.conf.Configuration.parse(Configuration.java:2548)
	at org.apache.hadoop.conf.Configuration.parse(Configuration.java:2536)
	at org.apache.hadoop.conf.Configuration.loadResource(Configuration.java:2607)
	at org.apache.hadoop.conf.Configuration.loadResources(Configuration.java:2560)
	at org.apache.hadoop.conf.Configuration.getProps(Configuration.java:2471)
	at org.apache.hadoop.conf.Configuration.set(Configuration.java:1207)
	at org.apache.hadoop.conf.Configuration.set(Configuration.java:1179)
	at org.apache.hadoop.yarn.server.resourcemanager.ParameterizedSchedulerTestBase.configureFairScheduler(ParameterizedSchedulerTestBase.java:97)
	at org.apache.hadoop.yarn.server.resourcemanager.ParameterizedSchedulerTestBase.configureScheduler(ParameterizedSchedulerTestBase.java:75)
	at sun.reflect.GeneratedMethodAccessor62.invoke(Unknown Source)
	at sun.reflect.DelegatingMethodAccessorImpl.invoke(DelegatingMethodAccessorImpl.java:43)
	at java.lang.reflect.Method.invoke(Method.java:606)
	at org.junit.runners.model.FrameworkMethod$1.runReflectiveCall(FrameworkMethod.java:47)
	at org.junit.internal.runners.model.ReflectiveCallable.run(ReflectiveCallable.java:12)
	at org.junit.runners.model.FrameworkMethod.invokeExplosively(FrameworkMethod.java:44)
	at org.junit.internal.runners.statements.RunBefores.evaluate(RunBefores.java:24)
	at org.junit.internal.runners.statements.RunAfters.evaluate(RunAfters.java:27)
	at org.junit.runners.ParentRunner.runLeaf(ParentRunner.java:271)
	at org.junit.runners.BlockJUnit4ClassRunner.runChild(BlockJUnit4ClassRunner.java:70)
	at org.junit.runners.BlockJUnit4ClassRunner.runChild(BlockJUnit4ClassRunner.java:50)
	at org.junit.runners.ParentRunner$3.run(ParentRunner.java:238)
	at org.junit.runners.ParentRunner$1.schedule(ParentRunner.java:63)
	at org.junit.runners.ParentRunner.runChildren(ParentRunner.java:236)
	at org.junit.runners.ParentRunner.access$000(ParentRunner.java:53)
	at org.junit.runners.ParentRunner$2.evaluate(ParentRunner.java:229)
	at org.junit.runners.ParentRunner.run(ParentRunner.java:309)
	at org.junit.runners.Suite.runChild(Suite.java:127)
	at org.junit.runners.Suite.runChild(Suite.java:26)
	at org.junit.runners.ParentRunner$3.run(ParentRunner.java:238)
	at org.junit.runners.ParentRunner$1.schedule(ParentRunner.java:63)
	at org.junit.runners.ParentRunner.runChildren(ParentRunner.java:236)
	at org.junit.runners.ParentRunner.access$000(ParentRunner.java:53)
	at org.junit.runners.ParentRunner$2.evaluate(ParentRunner.java:229)
	at org.junit.runners.ParentRunner.run(ParentRunner.java:309)
	at org.apache.maven.surefire.junit4.JUnit4Provider.execute(JUnit4Provider.java:264)
	at org.apache.maven.surefire.junit4.JUnit4Provider.executeTestSet(JUnit4Provider.java:153)
	at org.apache.maven.surefire.junit4.JUnit4Provider.invoke(JUnit4Provider.java:124)
	at org.apache.maven.surefire.booter.ForkedBooter.invokeProviderInSameClassLoader(ForkedBooter.java:200)
	at org.apache.maven.surefire.booter.ForkedBooter.runSuitesInProcess(ForkedBooter.java:153)
	at org.apache.maven.surefire.booter.ForkedBooter.main(ForkedBooter.java:103)


REGRESSION:  org.apache.hadoop.yarn.server.resourcemanager.TestRMRestart.testRMRestartWaitForPreviousAMToFinish[1]

Error Message:
org.xml.sax.SAXParseException; systemId: jar:file:/home/jenkins/.m2/repository/org/apache/hadoop/hadoop-common/3.0.0-SNAPSHOT/hadoop-common-3.0.0-SNAPSHOT.jar!/core-default.xml; lineNumber: 1; columnNumber: 1; Invalid byte 1 of 1-byte UTF-8 sequence.

Stack Trace:
java.lang.RuntimeException: org.xml.sax.SAXParseException; systemId: jar:file:/home/jenkins/.m2/repository/org/apache/hadoop/hadoop-common/3.0.0-SNAPSHOT/hadoop-common-3.0.0-SNAPSHOT.jar!/core-default.xml; lineNumber: 1; columnNumber: 1; Invalid byte 1 of 1-byte UTF-8 sequence.
	at org.apache.hadoop.conf.Configuration.loadResource(Configuration.java:2728)
	at org.apache.hadoop.conf.Configuration.loadResources(Configuration.java:2560)
	at org.apache.hadoop.conf.Configuration.getProps(Configuration.java:2471)
	at org.apache.hadoop.conf.Configuration.set(Configuration.java:1207)
	at org.apache.hadoop.conf.Configuration.set(Configuration.java:1179)
	at org.apache.hadoop.yarn.server.resourcemanager.ParameterizedSchedulerTestBase.configureFairScheduler(ParameterizedSchedulerTestBase.java:97)
	at org.apache.hadoop.yarn.server.resourcemanager.ParameterizedSchedulerTestBase.configureScheduler(ParameterizedSchedulerTestBase.java:75)
	at sun.reflect.GeneratedMethodAccessor62.invoke(Unknown Source)
	at sun.reflect.DelegatingMethodAccessorImpl.invoke(DelegatingMethodAccessorImpl.java:43)
	at java.lang.reflect.Method.invoke(Method.java:606)
	at org.junit.runners.model.FrameworkMethod$1.runReflectiveCall(FrameworkMethod.java:47)
	at org.junit.internal.runners.model.ReflectiveCallable.run(ReflectiveCallable.java:12)
	at org.junit.runners.model.FrameworkMethod.invokeExplosively(FrameworkMethod.java:44)
	at org.junit.internal.runners.statements.RunBefores.evaluate(RunBefores.java:24)
	at org.junit.internal.runners.statements.RunAfters.evaluate(RunAfters.java:27)
	at org.junit.runners.ParentRunner.runLeaf(ParentRunner.java:271)
	at org.junit.runners.BlockJUnit4ClassRunner.runChild(BlockJUnit4ClassRunner.java:70)
	at org.junit.runners.BlockJUnit4ClassRunner.runChild(BlockJUnit4ClassRunner.java:50)
	at org.junit.runners.ParentRunner$3.run(ParentRunner.java:238)
	at org.junit.runners.ParentRunner$1.schedule(ParentRunner.java:63)
	at org.junit.runners.ParentRunner.runChildren(ParentRunner.java:236)
	at org.junit.runners.ParentRunner.access$000(ParentRunner.java:53)
	at org.junit.runners.ParentRunner$2.evaluate(ParentRunner.java:229)
	at org.junit.runners.ParentRunner.run(ParentRunner.java:309)
	at org.junit.runners.Suite.runChild(Suite.java:127)
	at org.junit.runners.Suite.runChild(Suite.java:26)
	at org.junit.runners.ParentRunner$3.run(ParentRunner.java:238)
	at org.junit.runners.ParentRunner$1.schedule(ParentRunner.java:63)
	at org.junit.runners.ParentRunner.runChildren(ParentRunner.java:236)
	at org.junit.runners.ParentRunner.access$000(ParentRunner.java:53)
	at org.junit.runners.ParentRunner$2.evaluate(ParentRunner.java:229)
	at org.junit.runners.ParentRunner.run(ParentRunner.java:309)
	at org.apache.maven.surefire.junit4.JUnit4Provider.execute(JUnit4Provider.java:264)
	at org.apache.maven.surefire.junit4.JUnit4Provider.executeTestSet(JUnit4Provider.java:153)
	at org.apache.maven.surefire.junit4.JUnit4Provider.invoke(JUnit4Provider.java:124)
	at org.apache.maven.surefire.booter.ForkedBooter.invokeProviderInSameClassLoader(ForkedBooter.java:200)
	at org.apache.maven.surefire.booter.ForkedBooter.runSuitesInProcess(ForkedBooter.java:153)
	at org.apache.maven.surefire.booter.ForkedBooter.main(ForkedBooter.java:103)
Caused by: org.xml.sax.SAXParseException: Invalid byte 1 of 1-byte UTF-8 sequence.
	at org.apache.xerces.parsers.DOMParser.parse(Unknown Source)
	at org.apache.xerces.jaxp.DocumentBuilderImpl.parse(Unknown Source)
	at javax.xml.parsers.DocumentBuilder.parse(DocumentBuilder.java:150)
	at org.apache.hadoop.conf.Configuration.parse(Configuration.java:2548)
	at org.apache.hadoop.conf.Configuration.parse(Configuration.java:2536)
	at org.apache.hadoop.conf.Configuration.loadResource(Configuration.java:2607)
	at org.apache.hadoop.conf.Configuration.loadResources(Configuration.java:2560)
	at org.apache.hadoop.conf.Configuration.getProps(Configuration.java:2471)
	at org.apache.hadoop.conf.Configuration.set(Configuration.java:1207)
	at org.apache.hadoop.conf.Configuration.set(Configuration.java:1179)
	at org.apache.hadoop.yarn.server.resourcemanager.ParameterizedSchedulerTestBase.configureFairScheduler(ParameterizedSchedulerTestBase.java:97)
	at org.apache.hadoop.yarn.server.resourcemanager.ParameterizedSchedulerTestBase.configureScheduler(ParameterizedSchedulerTestBase.java:75)
	at sun.reflect.GeneratedMethodAccessor62.invoke(Unknown Source)
	at sun.reflect.DelegatingMethodAccessorImpl.invoke(DelegatingMethodAccessorImpl.java:43)
	at java.lang.reflect.Method.invoke(Method.java:606)
	at org.junit.runners.model.FrameworkMethod$1.runReflectiveCall(FrameworkMethod.java:47)
	at org.junit.internal.runners.model.ReflectiveCallable.run(ReflectiveCallable.java:12)
	at org.junit.runners.model.FrameworkMethod.invokeExplosively(FrameworkMethod.java:44)
	at org.junit.internal.runners.statements.RunBefores.evaluate(RunBefores.java:24)
	at org.junit.internal.runners.statements.RunAfters.evaluate(RunAfters.java:27)
	at org.junit.runners.ParentRunner.runLeaf(ParentRunner.java:271)
	at org.junit.runners.BlockJUnit4ClassRunner.runChild(BlockJUnit4ClassRunner.java:70)
	at org.junit.runners.BlockJUnit4ClassRunner.runChild(BlockJUnit4ClassRunner.java:50)
	at org.junit.runners.ParentRunner$3.run(ParentRunner.java:238)
	at org.junit.runners.ParentRunner$1.schedule(ParentRunner.java:63)
	at org.junit.runners.ParentRunner.runChildren(ParentRunner.java:236)
	at org.junit.runners.ParentRunner.access$000(ParentRunner.java:53)
	at org.junit.runners.ParentRunner$2.evaluate(ParentRunner.java:229)
	at org.junit.runners.ParentRunner.run(ParentRunner.java:309)
	at org.junit.runners.Suite.runChild(Suite.java:127)
	at org.junit.runners.Suite.runChild(Suite.java:26)
	at org.junit.runners.ParentRunner$3.run(ParentRunner.java:238)
	at org.junit.runners.ParentRunner$1.schedule(ParentRunner.java:63)
	at org.junit.runners.ParentRunner.runChildren(ParentRunner.java:236)
	at org.junit.runners.ParentRunner.access$000(ParentRunner.java:53)
	at org.junit.runners.ParentRunner$2.evaluate(ParentRunner.java:229)
	at org.junit.runners.ParentRunner.run(ParentRunner.java:309)
	at org.apache.maven.surefire.junit4.JUnit4Provider.execute(JUnit4Provider.java:264)
	at org.apache.maven.surefire.junit4.JUnit4Provider.executeTestSet(JUnit4Provider.java:153)
	at org.apache.maven.surefire.junit4.JUnit4Provider.invoke(JUnit4Provider.java:124)
	at org.apache.maven.surefire.booter.ForkedBooter.invokeProviderInSameClassLoader(ForkedBooter.java:200)
	at org.apache.maven.surefire.booter.ForkedBooter.runSuitesInProcess(ForkedBooter.java:153)
	at org.apache.maven.surefire.booter.ForkedBooter.main(ForkedBooter.java:103)
Caused by: org.apache.xerces.impl.io.MalformedByteSequenceException: Invalid byte 1 of 1-byte UTF-8 sequence.
	at org.apache.xerces.impl.io.UTF8Reader.invalidByte(Unknown Source)
	at org.apache.xerces.impl.io.UTF8Reader.read(Unknown Source)
	at org.apache.xerces.impl.XMLEntityScanner.load(Unknown Source)
	at org.apache.xerces.impl.XMLEntityScanner.skipString(Unknown Source)
	at org.apache.xerces.impl.XMLVersionDetector.determineDocVersion(Unknown Source)
	at org.apache.xerces.parsers.XML11Configuration.parse(Unknown Source)
	at org.apache.xerces.parsers.XML11Configuration.parse(Unknown Source)
	at org.apache.xerces.parsers.XMLParser.parse(Unknown Source)
	at org.apache.xerces.parsers.DOMParser.parse(Unknown Source)
	at org.apache.xerces.jaxp.DocumentBuilderImpl.parse(Unknown Source)
	at javax.xml.parsers.DocumentBuilder.parse(DocumentBuilder.java:150)
	at org.apache.hadoop.conf.Configuration.parse(Configuration.java:2548)
	at org.apache.hadoop.conf.Configuration.parse(Configuration.java:2536)
	at org.apache.hadoop.conf.Configuration.loadResource(Configuration.java:2607)
	at org.apache.hadoop.conf.Configuration.loadResources(Configuration.java:2560)
	at org.apache.hadoop.conf.Configuration.getProps(Configuration.java:2471)
	at org.apache.hadoop.conf.Configuration.set(Configuration.java:1207)
	at org.apache.hadoop.conf.Configuration.set(Configuration.java:1179)
	at org.apache.hadoop.yarn.server.resourcemanager.ParameterizedSchedulerTestBase.configureFairScheduler(ParameterizedSchedulerTestBase.java:97)
	at org.apache.hadoop.yarn.server.resourcemanager.ParameterizedSchedulerTestBase.configureScheduler(ParameterizedSchedulerTestBase.java:75)
	at sun.reflect.GeneratedMethodAccessor62.invoke(Unknown Source)
	at sun.reflect.DelegatingMethodAccessorImpl.invoke(DelegatingMethodAccessorImpl.java:43)
	at java.lang.reflect.Method.invoke(Method.java:606)
	at org.junit.runners.model.FrameworkMethod$1.runReflectiveCall(FrameworkMethod.java:47)
	at org.junit.internal.runners.model.ReflectiveCallable.run(ReflectiveCallable.java:12)
	at org.junit.runners.model.FrameworkMethod.invokeExplosively(FrameworkMethod.java:44)
	at org.junit.internal.runners.statements.RunBefores.evaluate(RunBefores.java:24)
	at org.junit.internal.runners.statements.RunAfters.evaluate(RunAfters.java:27)
	at org.junit.runners.ParentRunner.runLeaf(ParentRunner.java:271)
	at org.junit.runners.BlockJUnit4ClassRunner.runChild(BlockJUnit4ClassRunner.java:70)
	at org.junit.runners.BlockJUnit4ClassRunner.runChild(BlockJUnit4ClassRunner.java:50)
	at org.junit.runners.ParentRunner$3.run(ParentRunner.java:238)
	at org.junit.runners.ParentRunner$1.schedule(ParentRunner.java:63)
	at org.junit.runners.ParentRunner.runChildren(ParentRunner.java:236)
	at org.junit.runners.ParentRunner.access$000(ParentRunner.java:53)
	at org.junit.runners.ParentRunner$2.evaluate(ParentRunner.java:229)
	at org.junit.runners.ParentRunner.run(ParentRunner.java:309)
	at org.junit.runners.Suite.runChild(Suite.java:127)
	at org.junit.runners.Suite.runChild(Suite.java:26)
	at org.junit.runners.ParentRunner$3.run(ParentRunner.java:238)
	at org.junit.runners.ParentRunner$1.schedule(ParentRunner.java:63)
	at org.junit.runners.ParentRunner.runChildren(ParentRunner.java:236)
	at org.junit.runners.ParentRunner.access$000(ParentRunner.java:53)
	at org.junit.runners.ParentRunner$2.evaluate(ParentRunner.java:229)
	at org.junit.runners.ParentRunner.run(ParentRunner.java:309)
	at org.apache.maven.surefire.junit4.JUnit4Provider.execute(JUnit4Provider.java:264)
	at org.apache.maven.surefire.junit4.JUnit4Provider.executeTestSet(JUnit4Provider.java:153)
	at org.apache.maven.surefire.junit4.JUnit4Provider.invoke(JUnit4Provider.java:124)
	at org.apache.maven.surefire.booter.ForkedBooter.invokeProviderInSameClassLoader(ForkedBooter.java:200)
	at org.apache.maven.surefire.booter.ForkedBooter.runSuitesInProcess(ForkedBooter.java:153)
	at org.apache.maven.surefire.booter.ForkedBooter.main(ForkedBooter.java:103)


REGRESSION:  org.apache.hadoop.yarn.server.resourcemanager.TestRMRestart.testDecomissionedNMsMetricsOnRMRestart[1]

Error Message:
org.xml.sax.SAXParseException; systemId: jar:file:/home/jenkins/.m2/repository/org/apache/hadoop/hadoop-common/3.0.0-SNAPSHOT/hadoop-common-3.0.0-SNAPSHOT.jar!/core-default.xml; lineNumber: 1; columnNumber: 1; Invalid byte 1 of 1-byte UTF-8 sequence.

Stack Trace:
java.lang.RuntimeException: org.xml.sax.SAXParseException; systemId: jar:file:/home/jenkins/.m2/repository/org/apache/hadoop/hadoop-common/3.0.0-SNAPSHOT/hadoop-common-3.0.0-SNAPSHOT.jar!/core-default.xml; lineNumber: 1; columnNumber: 1; Invalid byte 1 of 1-byte UTF-8 sequence.
	at org.apache.hadoop.conf.Configuration.loadResource(Configuration.java:2728)
	at org.apache.hadoop.conf.Configuration.loadResources(Configuration.java:2560)
	at org.apache.hadoop.conf.Configuration.getProps(Configuration.java:2471)
	at org.apache.hadoop.conf.Configuration.set(Configuration.java:1207)
	at org.apache.hadoop.conf.Configuration.set(Configuration.java:1179)
	at org.apache.hadoop.yarn.server.resourcemanager.ParameterizedSchedulerTestBase.configureFairScheduler(ParameterizedSchedulerTestBase.java:97)
	at org.apache.hadoop.yarn.server.resourcemanager.ParameterizedSchedulerTestBase.configureScheduler(ParameterizedSchedulerTestBase.java:75)
	at sun.reflect.GeneratedMethodAccessor62.invoke(Unknown Source)
	at sun.reflect.DelegatingMethodAccessorImpl.invoke(DelegatingMethodAccessorImpl.java:43)
	at java.lang.reflect.Method.invoke(Method.java:606)
	at org.junit.runners.model.FrameworkMethod$1.runReflectiveCall(FrameworkMethod.java:47)
	at org.junit.internal.runners.model.ReflectiveCallable.run(ReflectiveCallable.java:12)
	at org.junit.runners.model.FrameworkMethod.invokeExplosively(FrameworkMethod.java:44)
	at org.junit.internal.runners.statements.RunBefores.evaluate(RunBefores.java:24)
	at org.junit.internal.runners.statements.RunAfters.evaluate(RunAfters.java:27)
	at org.junit.runners.ParentRunner.runLeaf(ParentRunner.java:271)
	at org.junit.runners.BlockJUnit4ClassRunner.runChild(BlockJUnit4ClassRunner.java:70)
	at org.junit.runners.BlockJUnit4ClassRunner.runChild(BlockJUnit4ClassRunner.java:50)
	at org.junit.runners.ParentRunner$3.run(ParentRunner.java:238)
	at org.junit.runners.ParentRunner$1.schedule(ParentRunner.java:63)
	at org.junit.runners.ParentRunner.runChildren(ParentRunner.java:236)
	at org.junit.runners.ParentRunner.access$000(ParentRunner.java:53)
	at org.junit.runners.ParentRunner$2.evaluate(ParentRunner.java:229)
	at org.junit.runners.ParentRunner.run(ParentRunner.java:309)
	at org.junit.runners.Suite.runChild(Suite.java:127)
	at org.junit.runners.Suite.runChild(Suite.java:26)
	at org.junit.runners.ParentRunner$3.run(ParentRunner.java:238)
	at org.junit.runners.ParentRunner$1.schedule(ParentRunner.java:63)
	at org.junit.runners.ParentRunner.runChildren(ParentRunner.java:236)
	at org.junit.runners.ParentRunner.access$000(ParentRunner.java:53)
	at org.junit.runners.ParentRunner$2.evaluate(ParentRunner.java:229)
	at org.junit.runners.ParentRunner.run(ParentRunner.java:309)
	at org.apache.maven.surefire.junit4.JUnit4Provider.execute(JUnit4Provider.java:264)
	at org.apache.maven.surefire.junit4.JUnit4Provider.executeTestSet(JUnit4Provider.java:153)
	at org.apache.maven.surefire.junit4.JUnit4Provider.invoke(JUnit4Provider.java:124)
	at org.apache.maven.surefire.booter.ForkedBooter.invokeProviderInSameClassLoader(ForkedBooter.java:200)
	at org.apache.maven.surefire.booter.ForkedBooter.runSuitesInProcess(ForkedBooter.java:153)
	at org.apache.maven.surefire.booter.ForkedBooter.main(ForkedBooter.java:103)
Caused by: org.xml.sax.SAXParseException: Invalid byte 1 of 1-byte UTF-8 sequence.
	at org.apache.xerces.parsers.DOMParser.parse(Unknown Source)
	at org.apache.xerces.jaxp.DocumentBuilderImpl.parse(Unknown Source)
	at javax.xml.parsers.DocumentBuilder.parse(DocumentBuilder.java:150)
	at org.apache.hadoop.conf.Configuration.parse(Configuration.java:2548)
	at org.apache.hadoop.conf.Configuration.parse(Configuration.java:2536)
	at org.apache.hadoop.conf.Configuration.loadResource(Configuration.java:2607)
	at org.apache.hadoop.conf.Configuration.loadResources(Configuration.java:2560)
	at org.apache.hadoop.conf.Configuration.getProps(Configuration.java:2471)
	at org.apache.hadoop.conf.Configuration.set(Configuration.java:1207)
	at org.apache.hadoop.conf.Configuration.set(Configuration.java:1179)
	at org.apache.hadoop.yarn.server.resourcemanager.ParameterizedSchedulerTestBase.configureFairScheduler(ParameterizedSchedulerTestBase.java:97)
	at org.apache.hadoop.yarn.server.resourcemanager.ParameterizedSchedulerTestBase.configureScheduler(ParameterizedSchedulerTestBase.java:75)
	at sun.reflect.GeneratedMethodAccessor62.invoke(Unknown Source)
	at sun.reflect.DelegatingMethodAccessorImpl.invoke(DelegatingMethodAccessorImpl.java:43)
	at java.lang.reflect.Method.invoke(Method.java:606)
	at org.junit.runners.model.FrameworkMethod$1.runReflectiveCall(FrameworkMethod.java:47)
	at org.junit.internal.runners.model.ReflectiveCallable.run(ReflectiveCallable.java:12)
	at org.junit.runners.model.FrameworkMethod.invokeExplosively(FrameworkMethod.java:44)
	at org.junit.internal.runners.statements.RunBefores.evaluate(RunBefores.java:24)
	at org.junit.internal.runners.statements.RunAfters.evaluate(RunAfters.java:27)
	at org.junit.runners.ParentRunner.runLeaf(ParentRunner.java:271)
	at org.junit.runners.BlockJUnit4ClassRunner.runChild(BlockJUnit4ClassRunner.java:70)
	at org.junit.runners.BlockJUnit4ClassRunner.runChild(BlockJUnit4ClassRunner.java:50)
	at org.junit.runners.ParentRunner$3.run(ParentRunner.java:238)
	at org.junit.runners.ParentRunner$1.schedule(ParentRunner.java:63)
	at org.junit.runners.ParentRunner.runChildren(ParentRunner.java:236)
	at org.junit.runners.ParentRunner.access$000(ParentRunner.java:53)
	at org.junit.runners.ParentRunner$2.evaluate(ParentRunner.java:229)
	at org.junit.runners.ParentRunner.run(ParentRunner.java:309)
	at org.junit.runners.Suite.runChild(Suite.java:127)
	at org.junit.runners.Suite.runChild(Suite.java:26)
	at org.junit.runners.ParentRunner$3.run(ParentRunner.java:238)
	at org.junit.runners.ParentRunner$1.schedule(ParentRunner.java:63)
	at org.junit.runners.ParentRunner.runChildren(ParentRunner.java:236)
	at org.junit.runners.ParentRunner.access$000(ParentRunner.java:53)
	at org.junit.runners.ParentRunner$2.evaluate(ParentRunner.java:229)
	at org.junit.runners.ParentRunner.run(ParentRunner.java:309)
	at org.apache.maven.surefire.junit4.JUnit4Provider.execute(JUnit4Provider.java:264)
	at org.apache.maven.surefire.junit4.JUnit4Provider.executeTestSet(JUnit4Provider.java:153)
	at org.apache.maven.surefire.junit4.JUnit4Provider.invoke(JUnit4Provider.java:124)
	at org.apache.maven.surefire.booter.ForkedBooter.invokeProviderInSameClassLoader(ForkedBooter.java:200)
	at org.apache.maven.surefire.booter.ForkedBooter.runSuitesInProcess(ForkedBooter.java:153)
	at org.apache.maven.surefire.booter.ForkedBooter.main(ForkedBooter.java:103)
Caused by: org.apache.xerces.impl.io.MalformedByteSequenceException: Invalid byte 1 of 1-byte UTF-8 sequence.
	at org.apache.xerces.impl.io.UTF8Reader.invalidByte(Unknown Source)
	at org.apache.xerces.impl.io.UTF8Reader.read(Unknown Source)
	at org.apache.xerces.impl.XMLEntityScanner.load(Unknown Source)
	at org.apache.xerces.impl.XMLEntityScanner.skipString(Unknown Source)
	at org.apache.xerces.impl.XMLVersionDetector.determineDocVersion(Unknown Source)
	at org.apache.xerces.parsers.XML11Configuration.parse(Unknown Source)
	at org.apache.xerces.parsers.XML11Configuration.parse(Unknown Source)
	at org.apache.xerces.parsers.XMLParser.parse(Unknown Source)
	at org.apache.xerces.parsers.DOMParser.parse(Unknown Source)
	at org.apache.xerces.jaxp.DocumentBuilderImpl.parse(Unknown Source)
	at javax.xml.parsers.DocumentBuilder.parse(DocumentBuilder.java:150)
	at org.apache.hadoop.conf.Configuration.parse(Configuration.java:2548)
	at org.apache.hadoop.conf.Configuration.parse(Configuration.java:2536)
	at org.apache.hadoop.conf.Configuration.loadResource(Configuration.java:2607)
	at org.apache.hadoop.conf.Configuration.loadResources(Configuration.java:2560)
	at org.apache.hadoop.conf.Configuration.getProps(Configuration.java:2471)
	at org.apache.hadoop.conf.Configuration.set(Configuration.java:1207)
	at org.apache.hadoop.conf.Configuration.set(Configuration.java:1179)
	at org.apache.hadoop.yarn.server.resourcemanager.ParameterizedSchedulerTestBase.configureFairScheduler(ParameterizedSchedulerTestBase.java:97)
	at org.apache.hadoop.yarn.server.resourcemanager.ParameterizedSchedulerTestBase.configureScheduler(ParameterizedSchedulerTestBase.java:75)
	at sun.reflect.GeneratedMethodAccessor62.invoke(Unknown Source)
	at sun.reflect.DelegatingMethodAccessorImpl.invoke(DelegatingMethodAccessorImpl.java:43)
	at java.lang.reflect.Method.invoke(Method.java:606)
	at org.junit.runners.model.FrameworkMethod$1.runReflectiveCall(FrameworkMethod.java:47)
	at org.junit.internal.runners.model.ReflectiveCallable.run(ReflectiveCallable.java:12)
	at org.junit.runners.model.FrameworkMethod.invokeExplosively(FrameworkMethod.java:44)
	at org.junit.internal.runners.statements.RunBefores.evaluate(RunBefores.java:24)
	at org.junit.internal.runners.statements.RunAfters.evaluate(RunAfters.java:27)
	at org.junit.runners.ParentRunner.runLeaf(ParentRunner.java:271)
	at org.junit.runners.BlockJUnit4ClassRunner.runChild(BlockJUnit4ClassRunner.java:70)
	at org.junit.runners.BlockJUnit4ClassRunner.runChild(BlockJUnit4ClassRunner.java:50)
	at org.junit.runners.ParentRunner$3.run(ParentRunner.java:238)
	at org.junit.runners.ParentRunner$1.schedule(ParentRunner.java:63)
	at org.junit.runners.ParentRunner.runChildren(ParentRunner.java:236)
	at org.junit.runners.ParentRunner.access$000(ParentRunner.java:53)
	at org.junit.runners.ParentRunner$2.evaluate(ParentRunner.java:229)
	at org.junit.runners.ParentRunner.run(ParentRunner.java:309)
	at org.junit.runners.Suite.runChild(Suite.java:127)
	at org.junit.runners.Suite.runChild(Suite.java:26)
	at org.junit.runners.ParentRunner$3.run(ParentRunner.java:238)
	at org.junit.runners.ParentRunner$1.schedule(ParentRunner.java:63)
	at org.junit.runners.ParentRunner.runChildren(ParentRunner.java:236)
	at org.junit.runners.ParentRunner.access$000(ParentRunner.java:53)
	at org.junit.runners.ParentRunner$2.evaluate(ParentRunner.java:229)
	at org.junit.runners.ParentRunner.run(ParentRunner.java:309)
	at org.apache.maven.surefire.junit4.JUnit4Provider.execute(JUnit4Provider.java:264)
	at org.apache.maven.surefire.junit4.JUnit4Provider.executeTestSet(JUnit4Provider.java:153)
	at org.apache.maven.surefire.junit4.JUnit4Provider.invoke(JUnit4Provider.java:124)
	at org.apache.maven.surefire.booter.ForkedBooter.invokeProviderInSameClassLoader(ForkedBooter.java:200)
	at org.apache.maven.surefire.booter.ForkedBooter.runSuitesInProcess(ForkedBooter.java:153)
	at org.apache.maven.surefire.booter.ForkedBooter.main(ForkedBooter.java:103)


REGRESSION:  org.apache.hadoop.yarn.server.resourcemanager.TestRMRestart.testFinishedAppRemovalAfterRMRestart[1]

Error Message:
org.xml.sax.SAXParseException; systemId: jar:file:/home/jenkins/.m2/repository/org/apache/hadoop/hadoop-common/3.0.0-SNAPSHOT/hadoop-common-3.0.0-SNAPSHOT.jar!/core-default.xml; lineNumber: 1; columnNumber: 1; Invalid byte 1 of 1-byte UTF-8 sequence.

Stack Trace:
java.lang.RuntimeException: org.xml.sax.SAXParseException; systemId: jar:file:/home/jenkins/.m2/repository/org/apache/hadoop/hadoop-common/3.0.0-SNAPSHOT/hadoop-common-3.0.0-SNAPSHOT.jar!/core-default.xml; lineNumber: 1; columnNumber: 1; Invalid byte 1 of 1-byte UTF-8 sequence.
	at org.apache.hadoop.conf.Configuration.loadResource(Configuration.java:2728)
	at org.apache.hadoop.conf.Configuration.loadResources(Configuration.java:2560)
	at org.apache.hadoop.conf.Configuration.getProps(Configuration.java:2471)
	at org.apache.hadoop.conf.Configuration.set(Configuration.java:1207)
	at org.apache.hadoop.conf.Configuration.set(Configuration.java:1179)
	at org.apache.hadoop.yarn.server.resourcemanager.ParameterizedSchedulerTestBase.configureFairScheduler(ParameterizedSchedulerTestBase.java:97)
	at org.apache.hadoop.yarn.server.resourcemanager.ParameterizedSchedulerTestBase.configureScheduler(ParameterizedSchedulerTestBase.java:75)
	at sun.reflect.GeneratedMethodAccessor62.invoke(Unknown Source)
	at sun.reflect.DelegatingMethodAccessorImpl.invoke(DelegatingMethodAccessorImpl.java:43)
	at java.lang.reflect.Method.invoke(Method.java:606)
	at org.junit.runners.model.FrameworkMethod$1.runReflectiveCall(FrameworkMethod.java:47)
	at org.junit.internal.runners.model.ReflectiveCallable.run(ReflectiveCallable.java:12)
	at org.junit.runners.model.FrameworkMethod.invokeExplosively(FrameworkMethod.java:44)
	at org.junit.internal.runners.statements.RunBefores.evaluate(RunBefores.java:24)
	at org.junit.internal.runners.statements.RunAfters.evaluate(RunAfters.java:27)
	at org.junit.runners.ParentRunner.runLeaf(ParentRunner.java:271)
	at org.junit.runners.BlockJUnit4ClassRunner.runChild(BlockJUnit4ClassRunner.java:70)
	at org.junit.runners.BlockJUnit4ClassRunner.runChild(BlockJUnit4ClassRunner.java:50)
	at org.junit.runners.ParentRunner$3.run(ParentRunner.java:238)
	at org.junit.runners.ParentRunner$1.schedule(ParentRunner.java:63)
	at org.junit.runners.ParentRunner.runChildren(ParentRunner.java:236)
	at org.junit.runners.ParentRunner.access$000(ParentRunner.java:53)
	at org.junit.runners.ParentRunner$2.evaluate(ParentRunner.java:229)
	at org.junit.runners.ParentRunner.run(ParentRunner.java:309)
	at org.junit.runners.Suite.runChild(Suite.java:127)
	at org.junit.runners.Suite.runChild(Suite.java:26)
	at org.junit.runners.ParentRunner$3.run(ParentRunner.java:238)
	at org.junit.runners.ParentRunner$1.schedule(ParentRunner.java:63)
	at org.junit.runners.ParentRunner.runChildren(ParentRunner.java:236)
	at org.junit.runners.ParentRunner.access$000(ParentRunner.java:53)
	at org.junit.runners.ParentRunner$2.evaluate(ParentRunner.java:229)
	at org.junit.runners.ParentRunner.run(ParentRunner.java:309)
	at org.apache.maven.surefire.junit4.JUnit4Provider.execute(JUnit4Provider.java:264)
	at org.apache.maven.surefire.junit4.JUnit4Provider.executeTestSet(JUnit4Provider.java:153)
	at org.apache.maven.surefire.junit4.JUnit4Provider.invoke(JUnit4Provider.java:124)
	at org.apache.maven.surefire.booter.ForkedBooter.invokeProviderInSameClassLoader(ForkedBooter.java:200)
	at org.apache.maven.surefire.booter.ForkedBooter.runSuitesInProcess(ForkedBooter.java:153)
	at org.apache.maven.surefire.booter.ForkedBooter.main(ForkedBooter.java:103)
Caused by: org.xml.sax.SAXParseException: Invalid byte 1 of 1-byte UTF-8 sequence.
	at org.apache.xerces.parsers.DOMParser.parse(Unknown Source)
	at org.apache.xerces.jaxp.DocumentBuilderImpl.parse(Unknown Source)
	at javax.xml.parsers.DocumentBuilder.parse(DocumentBuilder.java:150)
	at org.apache.hadoop.conf.Configuration.parse(Configuration.java:2548)
	at org.apache.hadoop.conf.Configuration.parse(Configuration.java:2536)
	at org.apache.hadoop.conf.Configuration.loadResource(Configuration.java:2607)
	at org.apache.hadoop.conf.Configuration.loadResources(Configuration.java:2560)
	at org.apache.hadoop.conf.Configuration.getProps(Configuration.java:2471)
	at org.apache.hadoop.conf.Configuration.set(Configuration.java:1207)
	at org.apache.hadoop.conf.Configuration.set(Configuration.java:1179)
	at org.apache.hadoop.yarn.server.resourcemanager.ParameterizedSchedulerTestBase.configureFairScheduler(ParameterizedSchedulerTestBase.java:97)
	at org.apache.hadoop.yarn.server.resourcemanager.ParameterizedSchedulerTestBase.configureScheduler(ParameterizedSchedulerTestBase.java:75)
	at sun.reflect.GeneratedMethodAccessor62.invoke(Unknown Source)
	at sun.reflect.DelegatingMethodAccessorImpl.invoke(DelegatingMethodAccessorImpl.java:43)
	at java.lang.reflect.Method.invoke(Method.java:606)
	at org.junit.runners.model.FrameworkMethod$1.runReflectiveCall(FrameworkMethod.java:47)
	at org.junit.internal.runners.model.ReflectiveCallable.run(ReflectiveCallable.java:12)
	at org.junit.runners.model.FrameworkMethod.invokeExplosively(FrameworkMethod.java:44)
	at org.junit.internal.runners.statements.RunBefores.evaluate(RunBefores.java:24)
	at org.junit.internal.runners.statements.RunAfters.evaluate(RunAfters.java:27)
	at org.junit.runners.ParentRunner.runLeaf(ParentRunner.java:271)
	at org.junit.runners.BlockJUnit4ClassRunner.runChild(BlockJUnit4ClassRunner.java:70)
	at org.junit.runners.BlockJUnit4ClassRunner.runChild(BlockJUnit4ClassRunner.java:50)
	at org.junit.runners.ParentRunner$3.run(ParentRunner.java:238)
	at org.junit.runners.ParentRunner$1.schedule(ParentRunner.java:63)
	at org.junit.runners.ParentRunner.runChildren(ParentRunner.java:236)
	at org.junit.runners.ParentRunner.access$000(ParentRunner.java:53)
	at org.junit.runners.ParentRunner$2.evaluate(ParentRunner.java:229)
	at org.junit.runners.ParentRunner.run(ParentRunner.java:309)
	at org.junit.runners.Suite.runChild(Suite.java:127)
	at org.junit.runners.Suite.runChild(Suite.java:26)
	at org.junit.runners.ParentRunner$3.run(ParentRunner.java:238)
	at org.junit.runners.ParentRunner$1.schedule(ParentRunner.java:63)
	at org.junit.runners.ParentRunner.runChildren(ParentRunner.java:236)
	at org.junit.runners.ParentRunner.access$000(ParentRunner.java:53)
	at org.junit.runners.ParentRunner$2.evaluate(ParentRunner.java:229)
	at org.junit.runners.ParentRunner.run(ParentRunner.java:309)
	at org.apache.maven.surefire.junit4.JUnit4Provider.execute(JUnit4Provider.java:264)
	at org.apache.maven.surefire.junit4.JUnit4Provider.executeTestSet(JUnit4Provider.java:153)
	at org.apache.maven.surefire.junit4.JUnit4Provider.invoke(JUnit4Provider.java:124)
	at org.apache.maven.surefire.booter.ForkedBooter.invokeProviderInSameClassLoader(ForkedBooter.java:200)
	at org.apache.maven.surefire.booter.ForkedBooter.runSuitesInProcess(ForkedBooter.java:153)
	at org.apache.maven.surefire.booter.ForkedBooter.main(ForkedBooter.java:103)
Caused by: org.apache.xerces.impl.io.MalformedByteSequenceException: Invalid byte 1 of 1-byte UTF-8 sequence.
	at org.apache.xerces.impl.io.UTF8Reader.invalidByte(Unknown Source)
	at org.apache.xerces.impl.io.UTF8Reader.read(Unknown Source)
	at org.apache.xerces.impl.XMLEntityScanner.load(Unknown Source)
	at org.apache.xerces.impl.XMLEntityScanner.skipString(Unknown Source)
	at org.apache.xerces.impl.XMLVersionDetector.determineDocVersion(Unknown Source)
	at org.apache.xerces.parsers.XML11Configuration.parse(Unknown Source)
	at org.apache.xerces.parsers.XML11Configuration.parse(Unknown Source)
	at org.apache.xerces.parsers.XMLParser.parse(Unknown Source)
	at org.apache.xerces.parsers.DOMParser.parse(Unknown Source)
	at org.apache.xerces.jaxp.DocumentBuilderImpl.parse(Unknown Source)
	at javax.xml.parsers.DocumentBuilder.parse(DocumentBuilder.java:150)
	at org.apache.hadoop.conf.Configuration.parse(Configuration.java:2548)
	at org.apache.hadoop.conf.Configuration.parse(Configuration.java:2536)
	at org.apache.hadoop.conf.Configuration.loadResource(Configuration.java:2607)
	at org.apache.hadoop.conf.Configuration.loadResources(Configuration.java:2560)
	at org.apache.hadoop.conf.Configuration.getProps(Configuration.java:2471)
	at org.apache.hadoop.conf.Configuration.set(Configuration.java:1207)
	at org.apache.hadoop.conf.Configuration.set(Configuration.java:1179)
	at org.apache.hadoop.yarn.server.resourcemanager.ParameterizedSchedulerTestBase.configureFairScheduler(ParameterizedSchedulerTestBase.java:97)
	at org.apache.hadoop.yarn.server.resourcemanager.ParameterizedSchedulerTestBase.configureScheduler(ParameterizedSchedulerTestBase.java:75)
	at sun.reflect.GeneratedMethodAccessor62.invoke(Unknown Source)
	at sun.reflect.DelegatingMethodAccessorImpl.invoke(DelegatingMethodAccessorImpl.java:43)
	at java.lang.reflect.Method.invoke(Method.java:606)
	at org.junit.runners.model.FrameworkMethod$1.runReflectiveCall(FrameworkMethod.java:47)
	at org.junit.internal.runners.model.ReflectiveCallable.run(ReflectiveCallable.java:12)
	at org.junit.runners.model.FrameworkMethod.invokeExplosively(FrameworkMethod.java:44)
	at org.junit.internal.runners.statements.RunBefores.evaluate(RunBefores.java:24)
	at org.junit.internal.runners.statements.RunAfters.evaluate(RunAfters.java:27)
	at org.junit.runners.ParentRunner.runLeaf(ParentRunner.java:271)
	at org.junit.runners.BlockJUnit4ClassRunner.runChild(BlockJUnit4ClassRunner.java:70)
	at org.junit.runners.BlockJUnit4ClassRunner.runChild(BlockJUnit4ClassRunner.java:50)
	at org.junit.runners.ParentRunner$3.run(ParentRunner.java:238)
	at org.junit.runners.ParentRunner$1.schedule(ParentRunner.java:63)
	at org.junit.runners.ParentRunner.runChildren(ParentRunner.java:236)
	at org.junit.runners.ParentRunner.access$000(ParentRunner.java:53)
	at org.junit.runners.ParentRunner$2.evaluate(ParentRunner.java:229)
	at org.junit.runners.ParentRunner.run(ParentRunner.java:309)
	at org.junit.runners.Suite.runChild(Suite.java:127)
	at org.junit.runners.Suite.runChild(Suite.java:26)
	at org.junit.runners.ParentRunner$3.run(ParentRunner.java:238)
	at org.junit.runners.ParentRunner$1.schedule(ParentRunner.java:63)
	at org.junit.runners.ParentRunner.runChildren(ParentRunner.java:236)
	at org.junit.runners.ParentRunner.access$000(ParentRunner.java:53)
	at org.junit.runners.ParentRunner$2.evaluate(ParentRunner.java:229)
	at org.junit.runners.ParentRunner.run(ParentRunner.java:309)
	at org.apache.maven.surefire.junit4.JUnit4Provider.execute(JUnit4Provider.java:264)
	at org.apache.maven.surefire.junit4.JUnit4Provider.executeTestSet(JUnit4Provider.java:153)
	at org.apache.maven.surefire.junit4.JUnit4Provider.invoke(JUnit4Provider.java:124)
	at org.apache.maven.surefire.booter.ForkedBooter.invokeProviderInSameClassLoader(ForkedBooter.java:200)
	at org.apache.maven.surefire.booter.ForkedBooter.runSuitesInProcess(ForkedBooter.java:153)
	at org.apache.maven.surefire.booter.ForkedBooter.main(ForkedBooter.java:103)


REGRESSION:  org.apache.hadoop.yarn.server.resourcemanager.ahs.TestRMApplicationHistoryWriter.testRMWritingMassiveHistoryForFairSche

Error Message:
AppAttempt state is not correct (timedout) expected:<ALLOCATED> but was:<SCHEDULED>

Stack Trace:
java.lang.AssertionError: AppAttempt state is not correct (timedout) expected:<ALLOCATED> but was:<SCHEDULED>
	at org.junit.Assert.fail(Assert.java:88)
	at org.junit.Assert.failNotEquals(Assert.java:743)
	at org.junit.Assert.assertEquals(Assert.java:118)
	at org.apache.hadoop.yarn.server.resourcemanager.MockAM.waitForState(MockAM.java:86)
	at org.apache.hadoop.yarn.server.resourcemanager.MockRM.sendAMLaunched(MockRM.java:507)
	at org.apache.hadoop.yarn.server.resourcemanager.ahs.TestRMApplicationHistoryWriter.testRMWritingMassiveHistory(TestRMApplicationHistoryWriter.java:451)
	at org.apache.hadoop.yarn.server.resourcemanager.ahs.TestRMApplicationHistoryWriter.testRMWritingMassiveHistory(TestRMApplicationHistoryWriter.java:431)
	at org.apache.hadoop.yarn.server.resourcemanager.ahs.TestRMApplicationHistoryWriter.testRMWritingMassiveHistoryForFairSche(TestRMApplicationHistoryWriter.java:377)


REGRESSION:  org.apache.hadoop.yarn.server.resourcemanager.ahs.TestRMApplicationHistoryWriter.testRMWritingMassiveHistoryForCapacitySche

Error Message:
AppAttempt state is not correct (timedout) expected:<ALLOCATED> but was:<SCHEDULED>

Stack Trace:
java.lang.AssertionError: AppAttempt state is not correct (timedout) expected:<ALLOCATED> but was:<SCHEDULED>
	at org.junit.Assert.fail(Assert.java:88)
	at org.junit.Assert.failNotEquals(Assert.java:743)
	at org.junit.Assert.assertEquals(Assert.java:118)
	at org.apache.hadoop.yarn.server.resourcemanager.MockAM.waitForState(MockAM.java:86)
	at org.apache.hadoop.yarn.server.resourcemanager.MockRM.sendAMLaunched(MockRM.java:507)
	at org.apache.hadoop.yarn.server.resourcemanager.ahs.TestRMApplicationHistoryWriter.testRMWritingMassiveHistory(TestRMApplicationHistoryWriter.java:451)
	at org.apache.hadoop.yarn.server.resourcemanager.ahs.TestRMApplicationHistoryWriter.testRMWritingMassiveHistory(TestRMApplicationHistoryWriter.java:431)
	at org.apache.hadoop.yarn.server.resourcemanager.ahs.TestRMApplicationHistoryWriter.testRMWritingMassiveHistoryForCapacitySche(TestRMApplicationHistoryWriter.java:383)


REGRESSION:  org.apache.hadoop.yarn.server.resourcemanager.applicationsmanager.TestAMRMRPCResponseId.testARRMResponseId

Error Message:
org/apache/hadoop/yarn/server/api/ResourceTracker

Stack Trace:
java.lang.NoClassDefFoundError: org/apache/hadoop/yarn/server/api/ResourceTracker
	at java.net.URLClassLoader$1.run(URLClassLoader.java:366)
	at java.net.URLClassLoader$1.run(URLClassLoader.java:355)
	at java.security.AccessController.doPrivileged(Native Method)
	at java.net.URLClassLoader.findClass(URLClassLoader.java:354)
	at java.lang.ClassLoader.loadClass(ClassLoader.java:425)
	at sun.misc.Launcher$AppClassLoader.loadClass(Launcher.java:308)
	at java.lang.ClassLoader.loadClass(ClassLoader.java:358)
	at java.lang.ClassLoader.defineClass1(Native Method)
	at java.lang.ClassLoader.defineClass(ClassLoader.java:800)
	at java.security.SecureClassLoader.defineClass(SecureClassLoader.java:142)
	at java.net.URLClassLoader.defineClass(URLClassLoader.java:449)
	at java.net.URLClassLoader.access$100(URLClassLoader.java:71)
	at java.net.URLClassLoader$1.run(URLClassLoader.java:361)
	at java.net.URLClassLoader$1.run(URLClassLoader.java:355)
	at java.security.AccessController.doPrivileged(Native Method)
	at java.net.URLClassLoader.findClass(URLClassLoader.java:354)
	at java.lang.ClassLoader.loadClass(ClassLoader.java:425)
	at sun.misc.Launcher$AppClassLoader.loadClass(Launcher.java:308)
	at java.lang.ClassLoader.loadClass(ClassLoader.java:358)
	at org.apache.hadoop.yarn.server.resourcemanager.applicationsmanager.TestAMRMRPCResponseId.setUp(TestAMRMRPCResponseId.java:47)


REGRESSION:  org.apache.hadoop.yarn.server.resourcemanager.applicationsmanager.TestAMRestart.testRMAppAttemptFailuresValidityInterval

Error Message:
org/apache/hadoop/yarn/event/Event

Stack Trace:
java.lang.NoClassDefFoundError: org/apache/hadoop/yarn/event/Event
	at java.net.URLClassLoader$1.run(URLClassLoader.java:366)
	at java.net.URLClassLoader$1.run(URLClassLoader.java:355)
	at java.security.AccessController.doPrivileged(Native Method)
	at java.net.URLClassLoader.findClass(URLClassLoader.java:354)
	at java.lang.ClassLoader.loadClass(ClassLoader.java:425)
	at sun.misc.Launcher$AppClassLoader.loadClass(Launcher.java:308)
	at java.lang.ClassLoader.loadClass(ClassLoader.java:358)
	at org.apache.hadoop.yarn.server.resourcemanager.applicationsmanager.TestAMRestart.testRMAppAttemptFailuresValidityInterval(TestAMRestart.java:606)


REGRESSION:  org.apache.hadoop.yarn.server.resourcemanager.applicationsmanager.TestAMRestart.testShouldNotCountFailureToMaxAttemptRetry

Error Message:
org/apache/hadoop/yarn/event/Event

Stack Trace:
java.lang.NoClassDefFoundError: org/apache/hadoop/yarn/event/Event
	at java.net.URLClassLoader$1.run(URLClassLoader.java:366)
	at java.net.URLClassLoader$1.run(URLClassLoader.java:355)
	at java.security.AccessController.doPrivileged(Native Method)
	at java.net.URLClassLoader.findClass(URLClassLoader.java:354)
	at java.lang.ClassLoader.loadClass(ClassLoader.java:425)
	at sun.misc.Launcher$AppClassLoader.loadClass(Launcher.java:308)
	at java.lang.ClassLoader.loadClass(ClassLoader.java:358)
	at org.apache.hadoop.yarn.server.resourcemanager.applicationsmanager.TestAMRestart.testShouldNotCountFailureToMaxAttemptRetry(TestAMRestart.java:369)


REGRESSION:  org.apache.hadoop.yarn.server.resourcemanager.applicationsmanager.TestAMRestart.testRMRestartOrFailoverNotCountedForAMFailures

Error Message:
org/apache/hadoop/yarn/event/Event

Stack Trace:
java.lang.NoClassDefFoundError: org/apache/hadoop/yarn/event/Event
	at java.net.URLClassLoader$1.run(URLClassLoader.java:366)
	at java.net.URLClassLoader$1.run(URLClassLoader.java:355)
	at java.security.AccessController.doPrivileged(Native Method)
	at java.net.URLClassLoader.findClass(URLClassLoader.java:354)
	at java.lang.ClassLoader.loadClass(ClassLoader.java:425)
	at sun.misc.Launcher$AppClassLoader.loadClass(Launcher.java:308)
	at java.lang.ClassLoader.loadClass(ClassLoader.java:358)
	at org.apache.hadoop.yarn.server.resourcemanager.applicationsmanager.TestAMRestart.testRMRestartOrFailoverNotCountedForAMFailures(TestAMRestart.java:545)


REGRESSION:  org.apache.hadoop.yarn.server.resourcemanager.applicationsmanager.TestAMRestart.testPreemptedAMRestartOnRMRestart

Error Message:
org/apache/hadoop/yarn/event/Event

Stack Trace:
java.lang.NoClassDefFoundError: org/apache/hadoop/yarn/event/Event
	at java.net.URLClassLoader$1.run(URLClassLoader.java:366)
	at java.net.URLClassLoader$1.run(URLClassLoader.java:355)
	at java.security.AccessController.doPrivileged(Native Method)
	at java.net.URLClassLoader.findClass(URLClassLoader.java:354)
	at java.lang.ClassLoader.loadClass(ClassLoader.java:425)
	at sun.misc.Launcher$AppClassLoader.loadClass(Launcher.java:308)
	at java.lang.ClassLoader.loadClass(ClassLoader.java:358)
	at org.apache.hadoop.yarn.server.resourcemanager.applicationsmanager.TestAMRestart.testPreemptedAMRestartOnRMRestart(TestAMRestart.java:478)


REGRESSION:  org.apache.hadoop.yarn.server.resourcemanager.applicationsmanager.TestAMRestart.testAMRestartWithExistingContainers

Error Message:
org/apache/hadoop/yarn/webapp/WebApp

Stack Trace:
java.lang.NoClassDefFoundError: org/apache/hadoop/yarn/webapp/WebApp
	at java.net.URLClassLoader$1.run(URLClassLoader.java:366)
	at java.net.URLClassLoader$1.run(URLClassLoader.java:355)
	at java.security.AccessController.doPrivileged(Native Method)
	at java.net.URLClassLoader.findClass(URLClassLoader.java:354)
	at java.lang.ClassLoader.loadClass(ClassLoader.java:425)
	at sun.misc.Launcher$AppClassLoader.loadClass(Launcher.java:308)
	at java.lang.ClassLoader.loadClass(ClassLoader.java:358)
	at org.apache.hadoop.yarn.server.resourcemanager.applicationsmanager.TestAMRestart.testAMRestartWithExistingContainers(TestAMRestart.java:70)


REGRESSION:  org.apache.hadoop.yarn.server.resourcemanager.applicationsmanager.TestAMRestart.testNMTokensRebindOnAMRestart

Error Message:
org/apache/hadoop/yarn/webapp/WebApp

Stack Trace:
java.lang.NoClassDefFoundError: org/apache/hadoop/yarn/webapp/WebApp
	at java.net.URLClassLoader$1.run(URLClassLoader.java:366)
	at java.net.URLClassLoader$1.run(URLClassLoader.java:355)
	at java.security.AccessController.doPrivileged(Native Method)
	at java.net.URLClassLoader.findClass(URLClassLoader.java:354)
	at java.lang.ClassLoader.loadClass(ClassLoader.java:425)
	at sun.misc.Launcher$AppClassLoader.loadClass(Launcher.java:308)
	at java.lang.ClassLoader.loadClass(ClassLoader.java:358)
	at org.apache.hadoop.yarn.server.resourcemanager.applicationsmanager.TestAMRestart.testNMTokensRebindOnAMRestart(TestAMRestart.java:262)


REGRESSION:  org.apache.hadoop.yarn.server.resourcemanager.webapp.TestRMWebServicesApps.testAppAttemptsSlash

Error Message:
null

Stack Trace:
java.lang.NullPointerException: null
	at org.apache.hadoop.yarn.server.resourcemanager.webapp.TestRMWebServicesApps.verifyAppAttemptInfoGeneric(TestRMWebServicesApps.java:1618)
	at org.apache.hadoop.yarn.server.resourcemanager.webapp.TestRMWebServicesApps.verifyAppAttemptsInfo(TestRMWebServicesApps.java:1603)
	at org.apache.hadoop.yarn.server.resourcemanager.webapp.TestRMWebServicesApps.testAppAttemptsHelper(TestRMWebServicesApps.java:1547)
	at org.apache.hadoop.yarn.server.resourcemanager.webapp.TestRMWebServicesApps.testAppAttemptsSlash(TestRMWebServicesApps.java:1439)


REGRESSION:  org.apache.hadoop.yarn.server.resourcemanager.webapp.TestRMWebServicesApps.testAppAttemtpsDefault

Error Message:
null

Stack Trace:
java.lang.NullPointerException: null
	at org.apache.hadoop.yarn.server.resourcemanager.webapp.TestRMWebServicesApps.verifyAppAttemptInfoGeneric(TestRMWebServicesApps.java:1618)
	at org.apache.hadoop.yarn.server.resourcemanager.webapp.TestRMWebServicesApps.verifyAppAttemptsInfo(TestRMWebServicesApps.java:1603)
	at org.apache.hadoop.yarn.server.resourcemanager.webapp.TestRMWebServicesApps.testAppAttemptsHelper(TestRMWebServicesApps.java:1547)
	at org.apache.hadoop.yarn.server.resourcemanager.webapp.TestRMWebServicesApps.testAppAttemtpsDefault(TestRMWebServicesApps.java:1450)


REGRESSION:  org.apache.hadoop.yarn.server.resourcemanager.webapp.TestRMWebServicesApps.testAppsSlash

Error Message:
incorrect number of elements expected:<27> but was:<25>

Stack Trace:
java.lang.AssertionError: incorrect number of elements expected:<27> but was:<25>
	at org.junit.Assert.fail(Assert.java:88)
	at org.junit.Assert.failNotEquals(Assert.java:743)
	at org.junit.Assert.assertEquals(Assert.java:118)
	at org.junit.Assert.assertEquals(Assert.java:555)
	at org.apache.hadoop.yarn.server.resourcemanager.webapp.TestRMWebServicesApps.verifyAppInfo(TestRMWebServicesApps.java:1317)
	at org.apache.hadoop.yarn.server.resourcemanager.webapp.TestRMWebServicesApps.testAppsHelper(TestRMWebServicesApps.java:213)
	at org.apache.hadoop.yarn.server.resourcemanager.webapp.TestRMWebServicesApps.testAppsSlash(TestRMWebServicesApps.java:134)


REGRESSION:  org.apache.hadoop.yarn.server.resourcemanager.webapp.TestRMWebServicesApps.testAppsQueryFinishBegin

Error Message:
AppAttempt state is not correct (timedout) expected:<ALLOCATED> but was:<SCHEDULED>

Stack Trace:
java.lang.AssertionError: AppAttempt state is not correct (timedout) expected:<ALLOCATED> but was:<SCHEDULED>
	at org.junit.Assert.fail(Assert.java:88)
	at org.junit.Assert.failNotEquals(Assert.java:743)
	at org.junit.Assert.assertEquals(Assert.java:118)
	at org.apache.hadoop.yarn.server.resourcemanager.MockAM.waitForState(MockAM.java:86)
	at org.apache.hadoop.yarn.server.resourcemanager.MockRM.sendAMLaunched(MockRM.java:507)
	at org.apache.hadoop.yarn.server.resourcemanager.webapp.TestRMWebServicesApps.testAppsQueryFinishBegin(TestRMWebServicesApps.java:702)


REGRESSION:  org.apache.hadoop.yarn.server.resourcemanager.webapp.TestRMWebServicesApps.testAppsXML

Error Message:
null

Stack Trace:
java.lang.NullPointerException: null
	at org.apache.hadoop.yarn.server.resourcemanager.webapp.TestRMWebServicesApps.verifyAppInfoGeneric(TestRMWebServicesApps.java:1367)
	at org.apache.hadoop.yarn.server.resourcemanager.webapp.TestRMWebServicesApps.verifyAppsXML(TestRMWebServicesApps.java:1287)
	at org.apache.hadoop.yarn.server.resourcemanager.webapp.TestRMWebServicesApps.testAppsXML(TestRMWebServicesApps.java:169)


REGRESSION:  org.apache.hadoop.yarn.server.resourcemanager.webapp.TestRMWebServicesApps.testApps

Error Message:
incorrect number of elements expected:<27> but was:<25>

Stack Trace:
java.lang.AssertionError: incorrect number of elements expected:<27> but was:<25>
	at org.junit.Assert.fail(Assert.java:88)
	at org.junit.Assert.failNotEquals(Assert.java:743)
	at org.junit.Assert.assertEquals(Assert.java:118)
	at org.junit.Assert.assertEquals(Assert.java:555)
	at org.apache.hadoop.yarn.server.resourcemanager.webapp.TestRMWebServicesApps.verifyAppInfo(TestRMWebServicesApps.java:1317)
	at org.apache.hadoop.yarn.server.resourcemanager.webapp.TestRMWebServicesApps.testAppsHelper(TestRMWebServicesApps.java:213)
	at org.apache.hadoop.yarn.server.resourcemanager.webapp.TestRMWebServicesApps.testApps(TestRMWebServicesApps.java:124)


REGRESSION:  org.apache.hadoop.yarn.server.resourcemanager.webapp.TestRMWebServicesApps.testSingleAppsXML

Error Message:
null

Stack Trace:
java.lang.NullPointerException: null
	at org.apache.hadoop.yarn.server.resourcemanager.webapp.TestRMWebServicesApps.verifyAppInfoGeneric(TestRMWebServicesApps.java:1367)
	at org.apache.hadoop.yarn.server.resourcemanager.webapp.TestRMWebServicesApps.verifyAppsXML(TestRMWebServicesApps.java:1287)
	at org.apache.hadoop.yarn.server.resourcemanager.webapp.TestRMWebServicesApps.testSingleAppsXML(TestRMWebServicesApps.java:1277)


REGRESSION:  org.apache.hadoop.yarn.server.resourcemanager.webapp.TestRMWebServicesApps.testSingleAppsSlash

Error Message:
incorrect number of elements expected:<27> but was:<25>

Stack Trace:
java.lang.AssertionError: incorrect number of elements expected:<27> but was:<25>
	at org.junit.Assert.fail(Assert.java:88)
	at org.junit.Assert.failNotEquals(Assert.java:743)
	at org.junit.Assert.assertEquals(Assert.java:118)
	at org.junit.Assert.assertEquals(Assert.java:555)
	at org.apache.hadoop.yarn.server.resourcemanager.webapp.TestRMWebServicesApps.verifyAppInfo(TestRMWebServicesApps.java:1317)
	at org.apache.hadoop.yarn.server.resourcemanager.webapp.TestRMWebServicesApps.testSingleAppsHelper(TestRMWebServicesApps.java:1254)
	at org.apache.hadoop.yarn.server.resourcemanager.webapp.TestRMWebServicesApps.testSingleAppsSlash(TestRMWebServicesApps.java:1157)


REGRESSION:  org.apache.hadoop.yarn.server.resourcemanager.webapp.TestRMWebServicesApps.testAppStatistics

Error Message:
AppAttempt state is not correct (timedout) expected:<ALLOCATED> but was:<SCHEDULED>

Stack Trace:
java.lang.AssertionError: AppAttempt state is not correct (timedout) expected:<ALLOCATED> but was:<SCHEDULED>
	at org.junit.Assert.fail(Assert.java:88)
	at org.junit.Assert.failNotEquals(Assert.java:743)
	at org.junit.Assert.assertEquals(Assert.java:118)
	at org.apache.hadoop.yarn.server.resourcemanager.MockAM.waitForState(MockAM.java:86)
	at org.apache.hadoop.yarn.server.resourcemanager.MockRM.sendAMLaunched(MockRM.java:507)
	at org.apache.hadoop.yarn.server.resourcemanager.webapp.TestRMWebServicesApps.testAppStatistics(TestRMWebServicesApps.java:987)


REGRESSION:  org.apache.hadoop.yarn.server.resourcemanager.webapp.TestRMWebServicesApps.testSingleApp

Error Message:
incorrect number of elements expected:<27> but was:<25>

Stack Trace:
java.lang.AssertionError: incorrect number of elements expected:<27> but was:<25>
	at org.junit.Assert.fail(Assert.java:88)
	at org.junit.Assert.failNotEquals(Assert.java:743)
	at org.junit.Assert.assertEquals(Assert.java:118)
	at org.junit.Assert.assertEquals(Assert.java:555)
	at org.apache.hadoop.yarn.server.resourcemanager.webapp.TestRMWebServicesApps.verifyAppInfo(TestRMWebServicesApps.java:1317)
	at org.apache.hadoop.yarn.server.resourcemanager.webapp.TestRMWebServicesApps.testSingleAppsHelper(TestRMWebServicesApps.java:1254)
	at org.apache.hadoop.yarn.server.resourcemanager.webapp.TestRMWebServicesApps.testSingleApp(TestRMWebServicesApps.java:1146)


REGRESSION:  org.apache.hadoop.yarn.server.resourcemanager.webapp.TestRMWebServicesApps.testAppsQueryFinalStatus

Error Message:
incorrect number of elements expected:<27> but was:<25>

Stack Trace:
java.lang.AssertionError: incorrect number of elements expected:<27> but was:<25>
	at org.junit.Assert.fail(Assert.java:88)
	at org.junit.Assert.failNotEquals(Assert.java:743)
	at org.junit.Assert.assertEquals(Assert.java:118)
	at org.junit.Assert.assertEquals(Assert.java:555)
	at org.apache.hadoop.yarn.server.resourcemanager.webapp.TestRMWebServicesApps.verifyAppInfo(TestRMWebServicesApps.java:1317)
	at org.apache.hadoop.yarn.server.resourcemanager.webapp.TestRMWebServicesApps.testAppsQueryFinalStatus(TestRMWebServicesApps.java:469)


REGRESSION:  org.apache.hadoop.yarn.server.resourcemanager.webapp.TestRMWebServicesApps.testAppAttemptsXML

Error Message:
null

Stack Trace:
java.lang.NullPointerException: null
	at org.apache.hadoop.yarn.server.resourcemanager.webapp.TestRMWebServicesApps.verifyAppAttemptInfoGeneric(TestRMWebServicesApps.java:1618)
	at org.apache.hadoop.yarn.server.resourcemanager.webapp.TestRMWebServicesApps.verifyAppAttemptsXML(TestRMWebServicesApps.java:1587)
	at org.apache.hadoop.yarn.server.resourcemanager.webapp.TestRMWebServicesApps.testAppAttemptsXML(TestRMWebServicesApps.java:1576)


REGRESSION:  org.apache.hadoop.yarn.server.resourcemanager.webapp.TestRMWebServicesApps.testAppAttempts

Error Message:
null

Stack Trace:
java.lang.NullPointerException: null
	at org.apache.hadoop.yarn.server.resourcemanager.webapp.TestRMWebServicesApps.verifyAppAttemptInfoGeneric(TestRMWebServicesApps.java:1618)
	at org.apache.hadoop.yarn.server.resourcemanager.webapp.TestRMWebServicesApps.verifyAppAttemptsInfo(TestRMWebServicesApps.java:1603)
	at org.apache.hadoop.yarn.server.resourcemanager.webapp.TestRMWebServicesApps.testAppAttemptsHelper(TestRMWebServicesApps.java:1547)
	at org.apache.hadoop.yarn.server.resourcemanager.webapp.TestRMWebServicesApps.testAppAttempts(TestRMWebServicesApps.java:1397)


REGRESSION:  org.apache.hadoop.yarn.server.resourcemanager.webapp.TestRMWebServicesApps.testMultipleAppAttempts

Error Message:
test timed out after 20000 milliseconds

Stack Trace:
java.lang.Exception: test timed out after 20000 milliseconds
	at java.lang.Thread.sleep(Native Method)
	at org.apache.hadoop.yarn.server.resourcemanager.MockAM.waitForState(MockAM.java:83)
	at org.apache.hadoop.yarn.server.resourcemanager.MockRM.sendAMLaunched(MockRM.java:507)
	at org.apache.hadoop.yarn.server.resourcemanager.MockRM.launchAM(MockRM.java:689)
	at org.apache.hadoop.yarn.server.resourcemanager.MockRM.launchAndRegisterAM(MockRM.java:696)
	at org.apache.hadoop.yarn.server.resourcemanager.webapp.TestRMWebServicesApps.testMultipleAppAttempts(TestRMWebServicesApps.java:1407)


REGRESSION:  org.apache.hadoop.yarn.server.resourcemanager.webapp.TestRMWebServicesApps.testAppsQueryFinishEnd

Error Message:
AppAttempt state is not correct (timedout) expected:<ALLOCATED> but was:<SCHEDULED>

Stack Trace:
java.lang.AssertionError: AppAttempt state is not correct (timedout) expected:<ALLOCATED> but was:<SCHEDULED>
	at org.junit.Assert.fail(Assert.java:88)
	at org.junit.Assert.failNotEquals(Assert.java:743)
	at org.junit.Assert.assertEquals(Assert.java:118)
	at org.apache.hadoop.yarn.server.resourcemanager.MockAM.waitForState(MockAM.java:86)
	at org.apache.hadoop.yarn.server.resourcemanager.MockRM.sendAMLaunched(MockRM.java:507)
	at org.apache.hadoop.yarn.server.resourcemanager.webapp.TestRMWebServicesApps.testAppsQueryFinishEnd(TestRMWebServicesApps.java:732)


REGRESSION:  org.apache.hadoop.yarn.server.resourcemanager.webapp.TestRMWebServicesApps.testAppsQueryState

Error Message:
incorrect number of elements expected:<27> but was:<25>

Stack Trace:
java.lang.AssertionError: incorrect number of elements expected:<27> but was:<25>
	at org.junit.Assert.fail(Assert.java:88)
	at org.junit.Assert.failNotEquals(Assert.java:743)
	at org.junit.Assert.assertEquals(Assert.java:118)
	at org.junit.Assert.assertEquals(Assert.java:555)
	at org.apache.hadoop.yarn.server.resourcemanager.webapp.TestRMWebServicesApps.verifyAppInfo(TestRMWebServicesApps.java:1317)
	at org.apache.hadoop.yarn.server.resourcemanager.webapp.TestRMWebServicesApps.testAppsQueryState(TestRMWebServicesApps.java:236)


REGRESSION:  org.apache.hadoop.yarn.server.resourcemanager.webapp.TestRMWebServicesApps.testSingleAppsDefault

Error Message:
incorrect number of elements expected:<27> but was:<25>

Stack Trace:
java.lang.AssertionError: incorrect number of elements expected:<27> but was:<25>
	at org.junit.Assert.fail(Assert.java:88)
	at org.junit.Assert.failNotEquals(Assert.java:743)
	at org.junit.Assert.assertEquals(Assert.java:118)
	at org.junit.Assert.assertEquals(Assert.java:555)
	at org.apache.hadoop.yarn.server.resourcemanager.webapp.TestRMWebServicesApps.verifyAppInfo(TestRMWebServicesApps.java:1317)
	at org.apache.hadoop.yarn.server.resourcemanager.webapp.TestRMWebServicesApps.testSingleAppsHelper(TestRMWebServicesApps.java:1254)
	at org.apache.hadoop.yarn.server.resourcemanager.webapp.TestRMWebServicesApps.testSingleAppsDefault(TestRMWebServicesApps.java:1168)


REGRESSION:  org.apache.hadoop.yarn.server.resourcemanager.webapp.TestRMWebServicesApps.testAppsQueryAppTypes

Error Message:
AppAttempt state is not correct (timedout) expected:<ALLOCATED> but was:<SCHEDULED>

Stack Trace:
java.lang.AssertionError: AppAttempt state is not correct (timedout) expected:<ALLOCATED> but was:<SCHEDULED>
	at org.junit.Assert.fail(Assert.java:88)
	at org.junit.Assert.failNotEquals(Assert.java:743)
	at org.junit.Assert.assertEquals(Assert.java:118)
	at org.apache.hadoop.yarn.server.resourcemanager.MockAM.waitForState(MockAM.java:86)
	at org.apache.hadoop.yarn.server.resourcemanager.MockRM.sendAMLaunched(MockRM.java:507)
	at org.apache.hadoop.yarn.server.resourcemanager.webapp.TestRMWebServicesApps.testAppsQueryAppTypes(TestRMWebServicesApps.java:800)


REGRESSION:  org.apache.hadoop.yarn.server.resourcemanager.webapp.TestRMWebServicesApps.testAppsDefault

Error Message:
incorrect number of elements expected:<27> but was:<25>

Stack Trace:
java.lang.AssertionError: incorrect number of elements expected:<27> but was:<25>
	at org.junit.Assert.fail(Assert.java:88)
	at org.junit.Assert.failNotEquals(Assert.java:743)
	at org.junit.Assert.assertEquals(Assert.java:118)
	at org.junit.Assert.assertEquals(Assert.java:555)
	at org.apache.hadoop.yarn.server.resourcemanager.webapp.TestRMWebServicesApps.verifyAppInfo(TestRMWebServicesApps.java:1317)
	at org.apache.hadoop.yarn.server.resourcemanager.webapp.TestRMWebServicesApps.testAppsHelper(TestRMWebServicesApps.java:213)
	at org.apache.hadoop.yarn.server.resourcemanager.webapp.TestRMWebServicesApps.testAppsDefault(TestRMWebServicesApps.java:144)


REGRESSION:  org.apache.hadoop.yarn.server.resourcemanager.webapp.TestRMWebServicesApps.testAppsQueryFinishBeginEnd

Error Message:
AppAttempt state is not correct (timedout) expected:<ALLOCATED> but was:<SCHEDULED>

Stack Trace:
java.lang.AssertionError: AppAttempt state is not correct (timedout) expected:<ALLOCATED> but was:<SCHEDULED>
	at org.junit.Assert.fail(Assert.java:88)
	at org.junit.Assert.failNotEquals(Assert.java:743)
	at org.junit.Assert.assertEquals(Assert.java:118)
	at org.apache.hadoop.yarn.server.resourcemanager.MockAM.waitForState(MockAM.java:86)
	at org.apache.hadoop.yarn.server.resourcemanager.MockRM.sendAMLaunched(MockRM.java:507)
	at org.apache.hadoop.yarn.server.resourcemanager.webapp.TestRMWebServicesApps.testAppsQueryFinishBeginEnd(TestRMWebServicesApps.java:766)



Mime
  • Unnamed multipart/mixed (inline, None, 0 bytes)
View raw message