hadoop-yarn-dev mailing list archives

Site index · List index
Message view « Date » · « Thread »
Top « Date » · « Thread »
From Apache Jenkins Server <jenk...@builds.apache.org>
Subject Build failed in Jenkins: Hadoop-Yarn-trunk #910
Date Mon, 27 Apr 2015 12:22:43 GMT
See <https://builds.apache.org/job/Hadoop-Yarn-trunk/910/changes>

Changes:

[kasha] YARN-3464. Race condition in LocalizerRunner kills localizer before localizing all
resources. (Zhihai Xu via kasha)

[aw] HADOOP-11865. Incorrect path mentioned in document for accessing script files (J.Andreina
via aw)

[aw] HADOOP-11357. Print information of the build enviornment in test-patch.sh (aw)

[jghoman] HADOOP-11857. Fix CommandFormat#commandFormat java doc annotation. Contributed by
J.Andreina.

[aw] MAPREDUCE-6057. Remove obsolete entries from mapred-default.xml (Ray Chiang via aw)

[devaraj] MAPREDUCE-6252. JobHistoryServer should not fail when encountering a

------------------------------------------
[...truncated 8776 lines...]
	at org.apache.hadoop.conf.Configuration.parse(Configuration.java:2546)
	at org.apache.hadoop.conf.Configuration.parse(Configuration.java:2534)
	at org.apache.hadoop.conf.Configuration.loadResource(Configuration.java:2605)
	at org.apache.hadoop.conf.Configuration.loadResources(Configuration.java:2558)
	at org.apache.hadoop.conf.Configuration.getProps(Configuration.java:2469)
	at org.apache.hadoop.conf.Configuration.set(Configuration.java:1205)
	at org.apache.hadoop.conf.Configuration.set(Configuration.java:1177)
	at org.apache.hadoop.conf.Configuration.setBoolean(Configuration.java:1513)
	at org.apache.hadoop.yarn.server.resourcemanager.webapp.TestRMWebServicesAppsModification$4.configureServlets(TestRMWebServicesAppsModification.java:256)
	at com.google.inject.servlet.ServletModule.configure(ServletModule.java:53)
	at com.google.inject.AbstractModule.configure(AbstractModule.java:59)
	at com.google.inject.spi.Elements$RecordingBinder.install(Elements.java:223)
	at com.google.inject.spi.Elements.getElements(Elements.java:101)
	at com.google.inject.internal.InjectorShell$Builder.build(InjectorShell.java:133)
	at com.google.inject.internal.InternalInjectorCreator.build(InternalInjectorCreator.java:103)
	at com.google.inject.Guice.createInjector(Guice.java:95)
	at com.google.inject.Guice.createInjector(Guice.java:72)
	at com.google.inject.Guice.createInjector(Guice.java:62)
	at org.apache.hadoop.yarn.server.resourcemanager.webapp.TestRMWebServicesAppsModification.getSimpleAuthInjectorFair(TestRMWebServicesAppsModification.java:252)
	at org.apache.hadoop.yarn.server.resourcemanager.webapp.TestRMWebServicesAppsModification.<init>(TestRMWebServicesAppsModification.java:299)

testGetNewApplication[3](org.apache.hadoop.yarn.server.resourcemanager.webapp.TestRMWebServicesAppsModification)
 Time elapsed: 0 sec  <<< ERROR!
com.sun.jersey.test.framework.spi.container.TestContainerException: java.net.BindException:
Address already in use
	at sun.nio.ch.Net.bind0(Native Method)
	at sun.nio.ch.Net.bind(Net.java:444)
	at sun.nio.ch.Net.bind(Net.java:436)
	at sun.nio.ch.ServerSocketChannelImpl.bind(ServerSocketChannelImpl.java:214)
	at sun.nio.ch.ServerSocketAdaptor.bind(ServerSocketAdaptor.java:74)
	at org.glassfish.grizzly.nio.transport.TCPNIOTransport.bind(TCPNIOTransport.java:413)
	at org.glassfish.grizzly.nio.transport.TCPNIOTransport.bind(TCPNIOTransport.java:384)
	at org.glassfish.grizzly.nio.transport.TCPNIOTransport.bind(TCPNIOTransport.java:375)
	at org.glassfish.grizzly.http.server.NetworkListener.start(NetworkListener.java:549)
	at org.glassfish.grizzly.http.server.HttpServer.start(HttpServer.java:255)
	at com.sun.jersey.api.container.grizzly2.GrizzlyServerFactory.createHttpServer(GrizzlyServerFactory.java:326)
	at com.sun.jersey.api.container.grizzly2.GrizzlyServerFactory.createHttpServer(GrizzlyServerFactory.java:343)
	at com.sun.jersey.test.framework.spi.container.grizzly2.web.GrizzlyWebTestContainerFactory$GrizzlyWebTestContainer.instantiateGrizzlyWebServer(GrizzlyWebTestContainerFactory.java:219)
	at com.sun.jersey.test.framework.spi.container.grizzly2.web.GrizzlyWebTestContainerFactory$GrizzlyWebTestContainer.<init>(GrizzlyWebTestContainerFactory.java:129)
	at com.sun.jersey.test.framework.spi.container.grizzly2.web.GrizzlyWebTestContainerFactory$GrizzlyWebTestContainer.<init>(GrizzlyWebTestContainerFactory.java:86)
	at com.sun.jersey.test.framework.spi.container.grizzly2.web.GrizzlyWebTestContainerFactory.create(GrizzlyWebTestContainerFactory.java:79)
	at com.sun.jersey.test.framework.JerseyTest.getContainer(JerseyTest.java:342)
	at com.sun.jersey.test.framework.JerseyTest.<init>(JerseyTest.java:217)
	at org.apache.hadoop.yarn.webapp.JerseyTestBase.<init>(JerseyTestBase.java:27)
	at org.apache.hadoop.yarn.server.resourcemanager.webapp.TestRMWebServicesAppsModification.<init>(TestRMWebServicesAppsModification.java:277)

testSingleAppKillInvalidId[3](org.apache.hadoop.yarn.server.resourcemanager.webapp.TestRMWebServicesAppsModification)
 Time elapsed: 0 sec  <<< ERROR!
com.sun.jersey.test.framework.spi.container.TestContainerException: java.net.BindException:
Address already in use
	at sun.nio.ch.Net.bind0(Native Method)
	at sun.nio.ch.Net.bind(Net.java:444)
	at sun.nio.ch.Net.bind(Net.java:436)
	at sun.nio.ch.ServerSocketChannelImpl.bind(ServerSocketChannelImpl.java:214)
	at sun.nio.ch.ServerSocketAdaptor.bind(ServerSocketAdaptor.java:74)
	at org.glassfish.grizzly.nio.transport.TCPNIOTransport.bind(TCPNIOTransport.java:413)
	at org.glassfish.grizzly.nio.transport.TCPNIOTransport.bind(TCPNIOTransport.java:384)
	at org.glassfish.grizzly.nio.transport.TCPNIOTransport.bind(TCPNIOTransport.java:375)
	at org.glassfish.grizzly.http.server.NetworkListener.start(NetworkListener.java:549)
	at org.glassfish.grizzly.http.server.HttpServer.start(HttpServer.java:255)
	at com.sun.jersey.api.container.grizzly2.GrizzlyServerFactory.createHttpServer(GrizzlyServerFactory.java:326)
	at com.sun.jersey.api.container.grizzly2.GrizzlyServerFactory.createHttpServer(GrizzlyServerFactory.java:343)
	at com.sun.jersey.test.framework.spi.container.grizzly2.web.GrizzlyWebTestContainerFactory$GrizzlyWebTestContainer.instantiateGrizzlyWebServer(GrizzlyWebTestContainerFactory.java:219)
	at com.sun.jersey.test.framework.spi.container.grizzly2.web.GrizzlyWebTestContainerFactory$GrizzlyWebTestContainer.<init>(GrizzlyWebTestContainerFactory.java:129)
	at com.sun.jersey.test.framework.spi.container.grizzly2.web.GrizzlyWebTestContainerFactory$GrizzlyWebTestContainer.<init>(GrizzlyWebTestContainerFactory.java:86)
	at com.sun.jersey.test.framework.spi.container.grizzly2.web.GrizzlyWebTestContainerFactory.create(GrizzlyWebTestContainerFactory.java:79)
	at com.sun.jersey.test.framework.JerseyTest.getContainer(JerseyTest.java:342)
	at com.sun.jersey.test.framework.JerseyTest.<init>(JerseyTest.java:217)
	at org.apache.hadoop.yarn.webapp.JerseyTestBase.<init>(JerseyTestBase.java:27)
	at org.apache.hadoop.yarn.server.resourcemanager.webapp.TestRMWebServicesAppsModification.<init>(TestRMWebServicesAppsModification.java:277)

testSingleAppState[3](org.apache.hadoop.yarn.server.resourcemanager.webapp.TestRMWebServicesAppsModification)
 Time elapsed: 0 sec  <<< ERROR!
com.sun.jersey.test.framework.spi.container.TestContainerException: java.net.BindException:
Address already in use
	at sun.nio.ch.Net.bind0(Native Method)
	at sun.nio.ch.Net.bind(Net.java:444)
	at sun.nio.ch.Net.bind(Net.java:436)
	at sun.nio.ch.ServerSocketChannelImpl.bind(ServerSocketChannelImpl.java:214)
	at sun.nio.ch.ServerSocketAdaptor.bind(ServerSocketAdaptor.java:74)
	at org.glassfish.grizzly.nio.transport.TCPNIOTransport.bind(TCPNIOTransport.java:413)
	at org.glassfish.grizzly.nio.transport.TCPNIOTransport.bind(TCPNIOTransport.java:384)
	at org.glassfish.grizzly.nio.transport.TCPNIOTransport.bind(TCPNIOTransport.java:375)
	at org.glassfish.grizzly.http.server.NetworkListener.start(NetworkListener.java:549)
	at org.glassfish.grizzly.http.server.HttpServer.start(HttpServer.java:255)
	at com.sun.jersey.api.container.grizzly2.GrizzlyServerFactory.createHttpServer(GrizzlyServerFactory.java:326)
	at com.sun.jersey.api.container.grizzly2.GrizzlyServerFactory.createHttpServer(GrizzlyServerFactory.java:343)
	at com.sun.jersey.test.framework.spi.container.grizzly2.web.GrizzlyWebTestContainerFactory$GrizzlyWebTestContainer.instantiateGrizzlyWebServer(GrizzlyWebTestContainerFactory.java:219)
	at com.sun.jersey.test.framework.spi.container.grizzly2.web.GrizzlyWebTestContainerFactory$GrizzlyWebTestContainer.<init>(GrizzlyWebTestContainerFactory.java:129)
	at com.sun.jersey.test.framework.spi.container.grizzly2.web.GrizzlyWebTestContainerFactory$GrizzlyWebTestContainer.<init>(GrizzlyWebTestContainerFactory.java:86)
	at com.sun.jersey.test.framework.spi.container.grizzly2.web.GrizzlyWebTestContainerFactory.create(GrizzlyWebTestContainerFactory.java:79)
	at com.sun.jersey.test.framework.JerseyTest.getContainer(JerseyTest.java:342)
	at com.sun.jersey.test.framework.JerseyTest.<init>(JerseyTest.java:217)
	at org.apache.hadoop.yarn.webapp.JerseyTestBase.<init>(JerseyTestBase.java:27)
	at org.apache.hadoop.yarn.server.resourcemanager.webapp.TestRMWebServicesAppsModification.<init>(TestRMWebServicesAppsModification.java:277)

testGetNewApplicationAndSubmit[3](org.apache.hadoop.yarn.server.resourcemanager.webapp.TestRMWebServicesAppsModification)
 Time elapsed: 0.001 sec  <<< ERROR!
com.sun.jersey.test.framework.spi.container.TestContainerException: java.net.BindException:
Address already in use
	at sun.nio.ch.Net.bind0(Native Method)
	at sun.nio.ch.Net.bind(Net.java:444)
	at sun.nio.ch.Net.bind(Net.java:436)
	at sun.nio.ch.ServerSocketChannelImpl.bind(ServerSocketChannelImpl.java:214)
	at sun.nio.ch.ServerSocketAdaptor.bind(ServerSocketAdaptor.java:74)
	at org.glassfish.grizzly.nio.transport.TCPNIOTransport.bind(TCPNIOTransport.java:413)
	at org.glassfish.grizzly.nio.transport.TCPNIOTransport.bind(TCPNIOTransport.java:384)
	at org.glassfish.grizzly.nio.transport.TCPNIOTransport.bind(TCPNIOTransport.java:375)
	at org.glassfish.grizzly.http.server.NetworkListener.start(NetworkListener.java:549)
	at org.glassfish.grizzly.http.server.HttpServer.start(HttpServer.java:255)
	at com.sun.jersey.api.container.grizzly2.GrizzlyServerFactory.createHttpServer(GrizzlyServerFactory.java:326)
	at com.sun.jersey.api.container.grizzly2.GrizzlyServerFactory.createHttpServer(GrizzlyServerFactory.java:343)
	at com.sun.jersey.test.framework.spi.container.grizzly2.web.GrizzlyWebTestContainerFactory$GrizzlyWebTestContainer.instantiateGrizzlyWebServer(GrizzlyWebTestContainerFactory.java:219)
	at com.sun.jersey.test.framework.spi.container.grizzly2.web.GrizzlyWebTestContainerFactory$GrizzlyWebTestContainer.<init>(GrizzlyWebTestContainerFactory.java:129)
	at com.sun.jersey.test.framework.spi.container.grizzly2.web.GrizzlyWebTestContainerFactory$GrizzlyWebTestContainer.<init>(GrizzlyWebTestContainerFactory.java:86)
	at com.sun.jersey.test.framework.spi.container.grizzly2.web.GrizzlyWebTestContainerFactory.create(GrizzlyWebTestContainerFactory.java:79)
	at com.sun.jersey.test.framework.JerseyTest.getContainer(JerseyTest.java:342)
	at com.sun.jersey.test.framework.JerseyTest.<init>(JerseyTest.java:217)
	at org.apache.hadoop.yarn.webapp.JerseyTestBase.<init>(JerseyTestBase.java:27)
	at org.apache.hadoop.yarn.server.resourcemanager.webapp.TestRMWebServicesAppsModification.<init>(TestRMWebServicesAppsModification.java:277)

testAppSubmitBadJsonAndXML[3](org.apache.hadoop.yarn.server.resourcemanager.webapp.TestRMWebServicesAppsModification)
 Time elapsed: 0 sec  <<< ERROR!
com.sun.jersey.test.framework.spi.container.TestContainerException: java.net.BindException:
Address already in use
	at sun.nio.ch.Net.bind0(Native Method)
	at sun.nio.ch.Net.bind(Net.java:444)
	at sun.nio.ch.Net.bind(Net.java:436)
	at sun.nio.ch.ServerSocketChannelImpl.bind(ServerSocketChannelImpl.java:214)
	at sun.nio.ch.ServerSocketAdaptor.bind(ServerSocketAdaptor.java:74)
	at org.glassfish.grizzly.nio.transport.TCPNIOTransport.bind(TCPNIOTransport.java:413)
	at org.glassfish.grizzly.nio.transport.TCPNIOTransport.bind(TCPNIOTransport.java:384)
	at org.glassfish.grizzly.nio.transport.TCPNIOTransport.bind(TCPNIOTransport.java:375)
	at org.glassfish.grizzly.http.server.NetworkListener.start(NetworkListener.java:549)
	at org.glassfish.grizzly.http.server.HttpServer.start(HttpServer.java:255)
	at com.sun.jersey.api.container.grizzly2.GrizzlyServerFactory.createHttpServer(GrizzlyServerFactory.java:326)
	at com.sun.jersey.api.container.grizzly2.GrizzlyServerFactory.createHttpServer(GrizzlyServerFactory.java:343)
	at com.sun.jersey.test.framework.spi.container.grizzly2.web.GrizzlyWebTestContainerFactory$GrizzlyWebTestContainer.instantiateGrizzlyWebServer(GrizzlyWebTestContainerFactory.java:219)
	at com.sun.jersey.test.framework.spi.container.grizzly2.web.GrizzlyWebTestContainerFactory$GrizzlyWebTestContainer.<init>(GrizzlyWebTestContainerFactory.java:129)
	at com.sun.jersey.test.framework.spi.container.grizzly2.web.GrizzlyWebTestContainerFactory$GrizzlyWebTestContainer.<init>(GrizzlyWebTestContainerFactory.java:86)
	at com.sun.jersey.test.framework.spi.container.grizzly2.web.GrizzlyWebTestContainerFactory.create(GrizzlyWebTestContainerFactory.java:79)
	at com.sun.jersey.test.framework.JerseyTest.getContainer(JerseyTest.java:342)
	at com.sun.jersey.test.framework.JerseyTest.<init>(JerseyTest.java:217)
	at org.apache.hadoop.yarn.webapp.JerseyTestBase.<init>(JerseyTestBase.java:27)
	at org.apache.hadoop.yarn.server.resourcemanager.webapp.TestRMWebServicesAppsModification.<init>(TestRMWebServicesAppsModification.java:277)

Running org.apache.hadoop.yarn.server.resourcemanager.webapp.TestNodesPage
Tests run: 5, Failures: 0, Errors: 0, Skipped: 0, Time elapsed: 7.128 sec - in org.apache.hadoop.yarn.server.resourcemanager.webapp.TestNodesPage
Running org.apache.hadoop.yarn.server.resourcemanager.webapp.TestAppPage
Tests run: 1, Failures: 0, Errors: 0, Skipped: 0, Time elapsed: 2.656 sec - in org.apache.hadoop.yarn.server.resourcemanager.webapp.TestAppPage
Running org.apache.hadoop.yarn.server.resourcemanager.webapp.TestRMWebServicesNodeLabels
Tests run: 1, Failures: 0, Errors: 0, Skipped: 0, Time elapsed: 4.547 sec - in org.apache.hadoop.yarn.server.resourcemanager.webapp.TestRMWebServicesNodeLabels
Running org.apache.hadoop.yarn.server.resourcemanager.webapp.TestRMWebServicesApps
Tests run: 40, Failures: 0, Errors: 0, Skipped: 0, Time elapsed: 173.675 sec - in org.apache.hadoop.yarn.server.resourcemanager.webapp.TestRMWebServicesApps
Running org.apache.hadoop.yarn.server.resourcemanager.webapp.TestRMWebServicesNodes
Tests run: 22, Failures: 0, Errors: 0, Skipped: 0, Time elapsed: 20.105 sec - in org.apache.hadoop.yarn.server.resourcemanager.webapp.TestRMWebServicesNodes
Running org.apache.hadoop.yarn.server.resourcemanager.webapp.TestRMWebServicesDelegationTokens
Tests run: 6, Failures: 0, Errors: 0, Skipped: 0, Time elapsed: 49.518 sec - in org.apache.hadoop.yarn.server.resourcemanager.webapp.TestRMWebServicesDelegationTokens
Running org.apache.hadoop.yarn.server.resourcemanager.webapp.TestRMWebServices
Tests run: 19, Failures: 0, Errors: 0, Skipped: 0, Time elapsed: 11.732 sec - in org.apache.hadoop.yarn.server.resourcemanager.webapp.TestRMWebServices
Running org.apache.hadoop.yarn.server.resourcemanager.webapp.TestRMWebServicesHttpStaticUserPermissions
Tests run: 1, Failures: 0, Errors: 0, Skipped: 0, Time elapsed: 8.494 sec - in org.apache.hadoop.yarn.server.resourcemanager.webapp.TestRMWebServicesHttpStaticUserPermissions
Running org.apache.hadoop.yarn.server.resourcemanager.webapp.TestRMWebServicesDelegationTokenAuthentication
Tests run: 8, Failures: 0, Errors: 0, Skipped: 0, Time elapsed: 9.918 sec - in org.apache.hadoop.yarn.server.resourcemanager.webapp.TestRMWebServicesDelegationTokenAuthentication
Running org.apache.hadoop.yarn.server.resourcemanager.webapp.TestRMWebApp
Tests run: 3, Failures: 0, Errors: 0, Skipped: 0, Time elapsed: 9.956 sec - in org.apache.hadoop.yarn.server.resourcemanager.webapp.TestRMWebApp
Running org.apache.hadoop.yarn.server.resourcemanager.webapp.TestRMWebServicesCapacitySched
Tests run: 7, Failures: 0, Errors: 0, Skipped: 0, Time elapsed: 15.662 sec - in org.apache.hadoop.yarn.server.resourcemanager.webapp.TestRMWebServicesCapacitySched
Running org.apache.hadoop.yarn.server.resourcemanager.webapp.TestRMWebServicesFairScheduler
Tests run: 2, Failures: 0, Errors: 0, Skipped: 0, Time elapsed: 4.544 sec - in org.apache.hadoop.yarn.server.resourcemanager.webapp.TestRMWebServicesFairScheduler
Running org.apache.hadoop.yarn.server.resourcemanager.webapp.TestRMWebappAuthentication
Tests run: 2, Failures: 0, Errors: 0, Skipped: 0, Time elapsed: 10.272 sec - in org.apache.hadoop.yarn.server.resourcemanager.webapp.TestRMWebappAuthentication
Running org.apache.hadoop.yarn.server.resourcemanager.webapp.TestRMWebAppFairScheduler
Tests run: 2, Failures: 0, Errors: 0, Skipped: 0, Time elapsed: 5.627 sec - in org.apache.hadoop.yarn.server.resourcemanager.webapp.TestRMWebAppFairScheduler
Running org.apache.hadoop.yarn.server.resourcemanager.resourcetracker.TestNMExpiry
Tests run: 1, Failures: 0, Errors: 0, Skipped: 0, Time elapsed: 13.294 sec - in org.apache.hadoop.yarn.server.resourcemanager.resourcetracker.TestNMExpiry
Running org.apache.hadoop.yarn.server.resourcemanager.resourcetracker.TestNMReconnect
Tests run: 1, Failures: 0, Errors: 0, Skipped: 0, Time elapsed: 1.622 sec - in org.apache.hadoop.yarn.server.resourcemanager.resourcetracker.TestNMReconnect
Running org.apache.hadoop.yarn.server.resourcemanager.resourcetracker.TestRMNMRPCResponseId
Tests run: 1, Failures: 0, Errors: 0, Skipped: 0, Time elapsed: 1.546 sec - in org.apache.hadoop.yarn.server.resourcemanager.resourcetracker.TestRMNMRPCResponseId
Running org.apache.hadoop.yarn.server.resourcemanager.TestAppManager
Tests run: 12, Failures: 0, Errors: 0, Skipped: 0, Time elapsed: 6.235 sec - in org.apache.hadoop.yarn.server.resourcemanager.TestAppManager
Running org.apache.hadoop.yarn.server.resourcemanager.recovery.TestZKRMStateStoreZKClientConnections
Tests run: 7, Failures: 0, Errors: 0, Skipped: 0, Time elapsed: 5.658 sec - in org.apache.hadoop.yarn.server.resourcemanager.recovery.TestZKRMStateStoreZKClientConnections
Running org.apache.hadoop.yarn.server.resourcemanager.recovery.TestZKRMStateStorePerf
Tests run: 1, Failures: 0, Errors: 0, Skipped: 0, Time elapsed: 39.141 sec - in org.apache.hadoop.yarn.server.resourcemanager.recovery.TestZKRMStateStorePerf
Running org.apache.hadoop.yarn.server.resourcemanager.recovery.TestLeveldbRMStateStore
Tests run: 8, Failures: 0, Errors: 0, Skipped: 0, Time elapsed: 4.939 sec - in org.apache.hadoop.yarn.server.resourcemanager.recovery.TestLeveldbRMStateStore
Running org.apache.hadoop.yarn.server.resourcemanager.recovery.TestFSRMStateStore
Tests run: 3, Failures: 0, Errors: 0, Skipped: 0, Time elapsed: 16.165 sec - in org.apache.hadoop.yarn.server.resourcemanager.recovery.TestFSRMStateStore
Running org.apache.hadoop.yarn.server.resourcemanager.recovery.TestZKRMStateStore
Tests run: 4, Failures: 0, Errors: 0, Skipped: 0, Time elapsed: 7.129 sec - in org.apache.hadoop.yarn.server.resourcemanager.recovery.TestZKRMStateStore
Running org.apache.hadoop.yarn.server.resourcemanager.TestClusterMetrics
Tests run: 1, Failures: 0, Errors: 0, Skipped: 0, Time elapsed: 0.425 sec - in org.apache.hadoop.yarn.server.resourcemanager.TestClusterMetrics
Running org.apache.hadoop.yarn.server.resourcemanager.TestRMAuditLogger
Tests run: 3, Failures: 0, Errors: 0, Skipped: 0, Time elapsed: 1.218 sec - in org.apache.hadoop.yarn.server.resourcemanager.TestRMAuditLogger

Results :

Tests in error: 
  TestRMWebServicesAppsModification.<init>:299->getSimpleAuthInjectorFair:252 »
Creation
  TestRMWebServicesAppsModification.<init>:277->JerseyTestBase.<init>:27->JerseyTest.<init>:217->JerseyTest.getContainer:342
» TestContainer
  TestRMWebServicesAppsModification.<init>:277->JerseyTestBase.<init>:27->JerseyTest.<init>:217->JerseyTest.getContainer:342
» TestContainer
  TestRMWebServicesAppsModification.<init>:277->JerseyTestBase.<init>:27->JerseyTest.<init>:217->JerseyTest.getContainer:342
» TestContainer
  TestRMWebServicesAppsModification.<init>:277->JerseyTestBase.<init>:27->JerseyTest.<init>:217->JerseyTest.getContainer:342
» TestContainer
  TestRMWebServicesAppsModification.<init>:277->JerseyTestBase.<init>:27->JerseyTest.<init>:217->JerseyTest.getContainer:342
» TestContainer

Tests run: 1083, Failures: 0, Errors: 6, Skipped: 1

[INFO] ------------------------------------------------------------------------
[INFO] Reactor Summary:
[INFO] 
[INFO] hadoop-yarn ....................................... SUCCESS [  2.993 s]
[INFO] hadoop-yarn-api ................................... SUCCESS [03:23 min]
[INFO] hadoop-yarn-common ................................ SUCCESS [03:06 min]
[INFO] hadoop-yarn-server ................................ SUCCESS [  0.096 s]
[INFO] hadoop-yarn-server-common ......................... SUCCESS [ 41.764 s]
[INFO] hadoop-yarn-server-nodemanager .................... SUCCESS [06:31 min]
[INFO] hadoop-yarn-server-web-proxy ...................... SUCCESS [ 23.629 s]
[INFO] hadoop-yarn-server-applicationhistoryservice ...... SUCCESS [03:01 min]
[INFO] hadoop-yarn-server-resourcemanager ................ FAILURE [52:47 min]
[INFO] hadoop-yarn-server-tests .......................... SKIPPED
[INFO] hadoop-yarn-client ................................ SKIPPED
[INFO] hadoop-yarn-server-sharedcachemanager ............. SKIPPED
[INFO] hadoop-yarn-applications .......................... SKIPPED
[INFO] hadoop-yarn-applications-distributedshell ......... SKIPPED
[INFO] hadoop-yarn-applications-unmanaged-am-launcher .... SKIPPED
[INFO] hadoop-yarn-site .................................. SKIPPED
[INFO] hadoop-yarn-registry .............................. SKIPPED
[INFO] hadoop-yarn-project ............................... SKIPPED
[INFO] ------------------------------------------------------------------------
[INFO] BUILD FAILURE
[INFO] ------------------------------------------------------------------------
[INFO] Total time: 01:09 h
[INFO] Finished at: 2015-04-27T12:22:34+00:00
[INFO] Final Memory: 62M/728M
[INFO] ------------------------------------------------------------------------
[ERROR] Failed to execute goal org.apache.maven.plugins:maven-surefire-plugin:2.17:test (default-test)
on project hadoop-yarn-server-resourcemanager: There are test failures.
[ERROR] 
[ERROR] Please refer to <https://builds.apache.org/job/Hadoop-Yarn-trunk/ws/hadoop-yarn-project/hadoop-yarn/hadoop-yarn-server/hadoop-yarn-server-resourcemanager/target/surefire-reports>
for the individual test results.
[ERROR] -> [Help 1]
[ERROR] 
[ERROR] To see the full stack trace of the errors, re-run Maven with the -e switch.
[ERROR] Re-run Maven using the -X switch to enable full debug logging.
[ERROR] 
[ERROR] For more information about the errors and possible solutions, please read the following
articles:
[ERROR] [Help 1] http://cwiki.apache.org/confluence/display/MAVEN/MojoFailureException
[ERROR] 
[ERROR] After correcting the problems, you can resume the build with the command
[ERROR]   mvn <goals> -rf :hadoop-yarn-server-resourcemanager
Build step 'Execute shell' marked build as failure
Archiving artifacts
Recording test results
Updating HADOOP-11857
Updating YARN-3464
Updating MAPREDUCE-6057
Updating HADOOP-11865
Updating HADOOP-11357
Updating MAPREDUCE-6252

Mime
View raw message