hadoop-yarn-dev mailing list archives

Site index · List index
Message view « Date » · « Thread »
Top « Date » · « Thread »
From Apache Jenkins Server <jenk...@builds.apache.org>
Subject Hadoop-Yarn-trunk - Build # 910 - Still Failing
Date Mon, 27 Apr 2015 12:22:44 GMT
See https://builds.apache.org/job/Hadoop-Yarn-trunk/910/

###################################################################################
########################## LAST 60 LINES OF THE CONSOLE ###########################
[...truncated 8969 lines...]
  TestRMWebServicesAppsModification.<init>:277->JerseyTestBase.<init>:27->JerseyTest.<init>:217->JerseyTest.getContainer:342
» TestContainer
  TestRMWebServicesAppsModification.<init>:277->JerseyTestBase.<init>:27->JerseyTest.<init>:217->JerseyTest.getContainer:342
» TestContainer
  TestRMWebServicesAppsModification.<init>:277->JerseyTestBase.<init>:27->JerseyTest.<init>:217->JerseyTest.getContainer:342
» TestContainer

Tests run: 1083, Failures: 0, Errors: 6, Skipped: 1

[INFO] ------------------------------------------------------------------------
[INFO] Reactor Summary:
[INFO] 
[INFO] hadoop-yarn ....................................... SUCCESS [  2.993 s]
[INFO] hadoop-yarn-api ................................... SUCCESS [03:23 min]
[INFO] hadoop-yarn-common ................................ SUCCESS [03:06 min]
[INFO] hadoop-yarn-server ................................ SUCCESS [  0.096 s]
[INFO] hadoop-yarn-server-common ......................... SUCCESS [ 41.764 s]
[INFO] hadoop-yarn-server-nodemanager .................... SUCCESS [06:31 min]
[INFO] hadoop-yarn-server-web-proxy ...................... SUCCESS [ 23.629 s]
[INFO] hadoop-yarn-server-applicationhistoryservice ...... SUCCESS [03:01 min]
[INFO] hadoop-yarn-server-resourcemanager ................ FAILURE [52:47 min]
[INFO] hadoop-yarn-server-tests .......................... SKIPPED
[INFO] hadoop-yarn-client ................................ SKIPPED
[INFO] hadoop-yarn-server-sharedcachemanager ............. SKIPPED
[INFO] hadoop-yarn-applications .......................... SKIPPED
[INFO] hadoop-yarn-applications-distributedshell ......... SKIPPED
[INFO] hadoop-yarn-applications-unmanaged-am-launcher .... SKIPPED
[INFO] hadoop-yarn-site .................................. SKIPPED
[INFO] hadoop-yarn-registry .............................. SKIPPED
[INFO] hadoop-yarn-project ............................... SKIPPED
[INFO] ------------------------------------------------------------------------
[INFO] BUILD FAILURE
[INFO] ------------------------------------------------------------------------
[INFO] Total time: 01:09 h
[INFO] Finished at: 2015-04-27T12:22:34+00:00
[INFO] Final Memory: 62M/728M
[INFO] ------------------------------------------------------------------------
[ERROR] Failed to execute goal org.apache.maven.plugins:maven-surefire-plugin:2.17:test (default-test)
on project hadoop-yarn-server-resourcemanager: There are test failures.
[ERROR] 
[ERROR] Please refer to /home/jenkins/jenkins-slave/workspace/Hadoop-Yarn-trunk/hadoop-yarn-project/hadoop-yarn/hadoop-yarn-server/hadoop-yarn-server-resourcemanager/target/surefire-reports
for the individual test results.
[ERROR] -> [Help 1]
[ERROR] 
[ERROR] To see the full stack trace of the errors, re-run Maven with the -e switch.
[ERROR] Re-run Maven using the -X switch to enable full debug logging.
[ERROR] 
[ERROR] For more information about the errors and possible solutions, please read the following
articles:
[ERROR] [Help 1] http://cwiki.apache.org/confluence/display/MAVEN/MojoFailureException
[ERROR] 
[ERROR] After correcting the problems, you can resume the build with the command
[ERROR]   mvn <goals> -rf :hadoop-yarn-server-resourcemanager
Build step 'Execute shell' marked build as failure
Archiving artifacts
Recording test results
Updating HADOOP-11857
Updating YARN-3464
Updating MAPREDUCE-6057
Updating HADOOP-11865
Updating HADOOP-11357
Updating MAPREDUCE-6252
Sending e-mails to: yarn-dev@hadoop.apache.org
Email was triggered for: Failure
Sending email for trigger: Failure



###################################################################################
############################## FAILED TESTS (if any) ##############################
6 tests failed.
REGRESSION:  org.apache.hadoop.yarn.server.resourcemanager.webapp.TestRMWebServicesAppsModification.testSingleAppKillUnauthorized[3]

Error Message:
Guice creation errors:

1) An exception was caught and reported. Message: java.util.zip.ZipException: invalid code
lengths set
  at com.google.inject.internal.InjectorShell$Builder.build(InjectorShell.java:133)

1 error

Stack Trace:
com.google.inject.CreationException: Guice creation errors:

1) An exception was caught and reported. Message: java.util.zip.ZipException: invalid code
lengths set
  at com.google.inject.internal.InjectorShell$Builder.build(InjectorShell.java:133)

1 error
	at java.util.zip.InflaterInputStream.read(InflaterInputStream.java:164)
	at java.util.zip.InflaterInputStream.read(InflaterInputStream.java:122)
	at java.io.FilterInputStream.read(FilterInputStream.java:83)
	at org.apache.xerces.impl.XMLEntityManager$RewindableInputStream.read(Unknown Source)
	at org.apache.xerces.impl.XMLEntityManager.setupCurrentEntity(Unknown Source)
	at org.apache.xerces.impl.XMLVersionDetector.determineDocVersion(Unknown Source)
	at org.apache.xerces.parsers.XML11Configuration.parse(Unknown Source)
	at org.apache.xerces.parsers.XML11Configuration.parse(Unknown Source)
	at org.apache.xerces.parsers.XMLParser.parse(Unknown Source)
	at org.apache.xerces.parsers.DOMParser.parse(Unknown Source)
	at org.apache.xerces.jaxp.DocumentBuilderImpl.parse(Unknown Source)
	at javax.xml.parsers.DocumentBuilder.parse(DocumentBuilder.java:150)
	at org.apache.hadoop.conf.Configuration.parse(Configuration.java:2546)
	at org.apache.hadoop.conf.Configuration.parse(Configuration.java:2534)
	at org.apache.hadoop.conf.Configuration.loadResource(Configuration.java:2605)
	at org.apache.hadoop.conf.Configuration.loadResources(Configuration.java:2558)
	at org.apache.hadoop.conf.Configuration.getProps(Configuration.java:2469)
	at org.apache.hadoop.conf.Configuration.set(Configuration.java:1205)
	at org.apache.hadoop.conf.Configuration.set(Configuration.java:1177)
	at org.apache.hadoop.conf.Configuration.setBoolean(Configuration.java:1513)
	at org.apache.hadoop.yarn.server.resourcemanager.webapp.TestRMWebServicesAppsModification$4.configureServlets(TestRMWebServicesAppsModification.java:256)
	at com.google.inject.servlet.ServletModule.configure(ServletModule.java:53)
	at com.google.inject.AbstractModule.configure(AbstractModule.java:59)
	at com.google.inject.spi.Elements$RecordingBinder.install(Elements.java:223)
	at com.google.inject.spi.Elements.getElements(Elements.java:101)
	at com.google.inject.internal.InjectorShell$Builder.build(InjectorShell.java:133)
	at com.google.inject.internal.InternalInjectorCreator.build(InternalInjectorCreator.java:103)
	at com.google.inject.Guice.createInjector(Guice.java:95)
	at com.google.inject.Guice.createInjector(Guice.java:72)
	at com.google.inject.Guice.createInjector(Guice.java:62)
	at org.apache.hadoop.yarn.server.resourcemanager.webapp.TestRMWebServicesAppsModification.getSimpleAuthInjectorFair(TestRMWebServicesAppsModification.java:252)
	at org.apache.hadoop.yarn.server.resourcemanager.webapp.TestRMWebServicesAppsModification.<init>(TestRMWebServicesAppsModification.java:299)


REGRESSION:  org.apache.hadoop.yarn.server.resourcemanager.webapp.TestRMWebServicesAppsModification.testGetNewApplication[3]

Error Message:
java.net.BindException: Address already in use

Stack Trace:
com.sun.jersey.test.framework.spi.container.TestContainerException: java.net.BindException:
Address already in use
	at sun.nio.ch.Net.bind0(Native Method)
	at sun.nio.ch.Net.bind(Net.java:444)
	at sun.nio.ch.Net.bind(Net.java:436)
	at sun.nio.ch.ServerSocketChannelImpl.bind(ServerSocketChannelImpl.java:214)
	at sun.nio.ch.ServerSocketAdaptor.bind(ServerSocketAdaptor.java:74)
	at org.glassfish.grizzly.nio.transport.TCPNIOTransport.bind(TCPNIOTransport.java:413)
	at org.glassfish.grizzly.nio.transport.TCPNIOTransport.bind(TCPNIOTransport.java:384)
	at org.glassfish.grizzly.nio.transport.TCPNIOTransport.bind(TCPNIOTransport.java:375)
	at org.glassfish.grizzly.http.server.NetworkListener.start(NetworkListener.java:549)
	at org.glassfish.grizzly.http.server.HttpServer.start(HttpServer.java:255)
	at com.sun.jersey.api.container.grizzly2.GrizzlyServerFactory.createHttpServer(GrizzlyServerFactory.java:326)
	at com.sun.jersey.api.container.grizzly2.GrizzlyServerFactory.createHttpServer(GrizzlyServerFactory.java:343)
	at com.sun.jersey.test.framework.spi.container.grizzly2.web.GrizzlyWebTestContainerFactory$GrizzlyWebTestContainer.instantiateGrizzlyWebServer(GrizzlyWebTestContainerFactory.java:219)
	at com.sun.jersey.test.framework.spi.container.grizzly2.web.GrizzlyWebTestContainerFactory$GrizzlyWebTestContainer.<init>(GrizzlyWebTestContainerFactory.java:129)
	at com.sun.jersey.test.framework.spi.container.grizzly2.web.GrizzlyWebTestContainerFactory$GrizzlyWebTestContainer.<init>(GrizzlyWebTestContainerFactory.java:86)
	at com.sun.jersey.test.framework.spi.container.grizzly2.web.GrizzlyWebTestContainerFactory.create(GrizzlyWebTestContainerFactory.java:79)
	at com.sun.jersey.test.framework.JerseyTest.getContainer(JerseyTest.java:342)
	at com.sun.jersey.test.framework.JerseyTest.<init>(JerseyTest.java:217)
	at org.apache.hadoop.yarn.webapp.JerseyTestBase.<init>(JerseyTestBase.java:27)
	at org.apache.hadoop.yarn.server.resourcemanager.webapp.TestRMWebServicesAppsModification.<init>(TestRMWebServicesAppsModification.java:277)


REGRESSION:  org.apache.hadoop.yarn.server.resourcemanager.webapp.TestRMWebServicesAppsModification.testSingleAppKillInvalidId[3]

Error Message:
java.net.BindException: Address already in use

Stack Trace:
com.sun.jersey.test.framework.spi.container.TestContainerException: java.net.BindException:
Address already in use
	at sun.nio.ch.Net.bind0(Native Method)
	at sun.nio.ch.Net.bind(Net.java:444)
	at sun.nio.ch.Net.bind(Net.java:436)
	at sun.nio.ch.ServerSocketChannelImpl.bind(ServerSocketChannelImpl.java:214)
	at sun.nio.ch.ServerSocketAdaptor.bind(ServerSocketAdaptor.java:74)
	at org.glassfish.grizzly.nio.transport.TCPNIOTransport.bind(TCPNIOTransport.java:413)
	at org.glassfish.grizzly.nio.transport.TCPNIOTransport.bind(TCPNIOTransport.java:384)
	at org.glassfish.grizzly.nio.transport.TCPNIOTransport.bind(TCPNIOTransport.java:375)
	at org.glassfish.grizzly.http.server.NetworkListener.start(NetworkListener.java:549)
	at org.glassfish.grizzly.http.server.HttpServer.start(HttpServer.java:255)
	at com.sun.jersey.api.container.grizzly2.GrizzlyServerFactory.createHttpServer(GrizzlyServerFactory.java:326)
	at com.sun.jersey.api.container.grizzly2.GrizzlyServerFactory.createHttpServer(GrizzlyServerFactory.java:343)
	at com.sun.jersey.test.framework.spi.container.grizzly2.web.GrizzlyWebTestContainerFactory$GrizzlyWebTestContainer.instantiateGrizzlyWebServer(GrizzlyWebTestContainerFactory.java:219)
	at com.sun.jersey.test.framework.spi.container.grizzly2.web.GrizzlyWebTestContainerFactory$GrizzlyWebTestContainer.<init>(GrizzlyWebTestContainerFactory.java:129)
	at com.sun.jersey.test.framework.spi.container.grizzly2.web.GrizzlyWebTestContainerFactory$GrizzlyWebTestContainer.<init>(GrizzlyWebTestContainerFactory.java:86)
	at com.sun.jersey.test.framework.spi.container.grizzly2.web.GrizzlyWebTestContainerFactory.create(GrizzlyWebTestContainerFactory.java:79)
	at com.sun.jersey.test.framework.JerseyTest.getContainer(JerseyTest.java:342)
	at com.sun.jersey.test.framework.JerseyTest.<init>(JerseyTest.java:217)
	at org.apache.hadoop.yarn.webapp.JerseyTestBase.<init>(JerseyTestBase.java:27)
	at org.apache.hadoop.yarn.server.resourcemanager.webapp.TestRMWebServicesAppsModification.<init>(TestRMWebServicesAppsModification.java:277)


REGRESSION:  org.apache.hadoop.yarn.server.resourcemanager.webapp.TestRMWebServicesAppsModification.testSingleAppState[3]

Error Message:
java.net.BindException: Address already in use

Stack Trace:
com.sun.jersey.test.framework.spi.container.TestContainerException: java.net.BindException:
Address already in use
	at sun.nio.ch.Net.bind0(Native Method)
	at sun.nio.ch.Net.bind(Net.java:444)
	at sun.nio.ch.Net.bind(Net.java:436)
	at sun.nio.ch.ServerSocketChannelImpl.bind(ServerSocketChannelImpl.java:214)
	at sun.nio.ch.ServerSocketAdaptor.bind(ServerSocketAdaptor.java:74)
	at org.glassfish.grizzly.nio.transport.TCPNIOTransport.bind(TCPNIOTransport.java:413)
	at org.glassfish.grizzly.nio.transport.TCPNIOTransport.bind(TCPNIOTransport.java:384)
	at org.glassfish.grizzly.nio.transport.TCPNIOTransport.bind(TCPNIOTransport.java:375)
	at org.glassfish.grizzly.http.server.NetworkListener.start(NetworkListener.java:549)
	at org.glassfish.grizzly.http.server.HttpServer.start(HttpServer.java:255)
	at com.sun.jersey.api.container.grizzly2.GrizzlyServerFactory.createHttpServer(GrizzlyServerFactory.java:326)
	at com.sun.jersey.api.container.grizzly2.GrizzlyServerFactory.createHttpServer(GrizzlyServerFactory.java:343)
	at com.sun.jersey.test.framework.spi.container.grizzly2.web.GrizzlyWebTestContainerFactory$GrizzlyWebTestContainer.instantiateGrizzlyWebServer(GrizzlyWebTestContainerFactory.java:219)
	at com.sun.jersey.test.framework.spi.container.grizzly2.web.GrizzlyWebTestContainerFactory$GrizzlyWebTestContainer.<init>(GrizzlyWebTestContainerFactory.java:129)
	at com.sun.jersey.test.framework.spi.container.grizzly2.web.GrizzlyWebTestContainerFactory$GrizzlyWebTestContainer.<init>(GrizzlyWebTestContainerFactory.java:86)
	at com.sun.jersey.test.framework.spi.container.grizzly2.web.GrizzlyWebTestContainerFactory.create(GrizzlyWebTestContainerFactory.java:79)
	at com.sun.jersey.test.framework.JerseyTest.getContainer(JerseyTest.java:342)
	at com.sun.jersey.test.framework.JerseyTest.<init>(JerseyTest.java:217)
	at org.apache.hadoop.yarn.webapp.JerseyTestBase.<init>(JerseyTestBase.java:27)
	at org.apache.hadoop.yarn.server.resourcemanager.webapp.TestRMWebServicesAppsModification.<init>(TestRMWebServicesAppsModification.java:277)


REGRESSION:  org.apache.hadoop.yarn.server.resourcemanager.webapp.TestRMWebServicesAppsModification.testGetNewApplicationAndSubmit[3]

Error Message:
java.net.BindException: Address already in use

Stack Trace:
com.sun.jersey.test.framework.spi.container.TestContainerException: java.net.BindException:
Address already in use
	at sun.nio.ch.Net.bind0(Native Method)
	at sun.nio.ch.Net.bind(Net.java:444)
	at sun.nio.ch.Net.bind(Net.java:436)
	at sun.nio.ch.ServerSocketChannelImpl.bind(ServerSocketChannelImpl.java:214)
	at sun.nio.ch.ServerSocketAdaptor.bind(ServerSocketAdaptor.java:74)
	at org.glassfish.grizzly.nio.transport.TCPNIOTransport.bind(TCPNIOTransport.java:413)
	at org.glassfish.grizzly.nio.transport.TCPNIOTransport.bind(TCPNIOTransport.java:384)
	at org.glassfish.grizzly.nio.transport.TCPNIOTransport.bind(TCPNIOTransport.java:375)
	at org.glassfish.grizzly.http.server.NetworkListener.start(NetworkListener.java:549)
	at org.glassfish.grizzly.http.server.HttpServer.start(HttpServer.java:255)
	at com.sun.jersey.api.container.grizzly2.GrizzlyServerFactory.createHttpServer(GrizzlyServerFactory.java:326)
	at com.sun.jersey.api.container.grizzly2.GrizzlyServerFactory.createHttpServer(GrizzlyServerFactory.java:343)
	at com.sun.jersey.test.framework.spi.container.grizzly2.web.GrizzlyWebTestContainerFactory$GrizzlyWebTestContainer.instantiateGrizzlyWebServer(GrizzlyWebTestContainerFactory.java:219)
	at com.sun.jersey.test.framework.spi.container.grizzly2.web.GrizzlyWebTestContainerFactory$GrizzlyWebTestContainer.<init>(GrizzlyWebTestContainerFactory.java:129)
	at com.sun.jersey.test.framework.spi.container.grizzly2.web.GrizzlyWebTestContainerFactory$GrizzlyWebTestContainer.<init>(GrizzlyWebTestContainerFactory.java:86)
	at com.sun.jersey.test.framework.spi.container.grizzly2.web.GrizzlyWebTestContainerFactory.create(GrizzlyWebTestContainerFactory.java:79)
	at com.sun.jersey.test.framework.JerseyTest.getContainer(JerseyTest.java:342)
	at com.sun.jersey.test.framework.JerseyTest.<init>(JerseyTest.java:217)
	at org.apache.hadoop.yarn.webapp.JerseyTestBase.<init>(JerseyTestBase.java:27)
	at org.apache.hadoop.yarn.server.resourcemanager.webapp.TestRMWebServicesAppsModification.<init>(TestRMWebServicesAppsModification.java:277)


REGRESSION:  org.apache.hadoop.yarn.server.resourcemanager.webapp.TestRMWebServicesAppsModification.testAppSubmitBadJsonAndXML[3]

Error Message:
java.net.BindException: Address already in use

Stack Trace:
com.sun.jersey.test.framework.spi.container.TestContainerException: java.net.BindException:
Address already in use
	at sun.nio.ch.Net.bind0(Native Method)
	at sun.nio.ch.Net.bind(Net.java:444)
	at sun.nio.ch.Net.bind(Net.java:436)
	at sun.nio.ch.ServerSocketChannelImpl.bind(ServerSocketChannelImpl.java:214)
	at sun.nio.ch.ServerSocketAdaptor.bind(ServerSocketAdaptor.java:74)
	at org.glassfish.grizzly.nio.transport.TCPNIOTransport.bind(TCPNIOTransport.java:413)
	at org.glassfish.grizzly.nio.transport.TCPNIOTransport.bind(TCPNIOTransport.java:384)
	at org.glassfish.grizzly.nio.transport.TCPNIOTransport.bind(TCPNIOTransport.java:375)
	at org.glassfish.grizzly.http.server.NetworkListener.start(NetworkListener.java:549)
	at org.glassfish.grizzly.http.server.HttpServer.start(HttpServer.java:255)
	at com.sun.jersey.api.container.grizzly2.GrizzlyServerFactory.createHttpServer(GrizzlyServerFactory.java:326)
	at com.sun.jersey.api.container.grizzly2.GrizzlyServerFactory.createHttpServer(GrizzlyServerFactory.java:343)
	at com.sun.jersey.test.framework.spi.container.grizzly2.web.GrizzlyWebTestContainerFactory$GrizzlyWebTestContainer.instantiateGrizzlyWebServer(GrizzlyWebTestContainerFactory.java:219)
	at com.sun.jersey.test.framework.spi.container.grizzly2.web.GrizzlyWebTestContainerFactory$GrizzlyWebTestContainer.<init>(GrizzlyWebTestContainerFactory.java:129)
	at com.sun.jersey.test.framework.spi.container.grizzly2.web.GrizzlyWebTestContainerFactory$GrizzlyWebTestContainer.<init>(GrizzlyWebTestContainerFactory.java:86)
	at com.sun.jersey.test.framework.spi.container.grizzly2.web.GrizzlyWebTestContainerFactory.create(GrizzlyWebTestContainerFactory.java:79)
	at com.sun.jersey.test.framework.JerseyTest.getContainer(JerseyTest.java:342)
	at com.sun.jersey.test.framework.JerseyTest.<init>(JerseyTest.java:217)
	at org.apache.hadoop.yarn.webapp.JerseyTestBase.<init>(JerseyTestBase.java:27)
	at org.apache.hadoop.yarn.server.resourcemanager.webapp.TestRMWebServicesAppsModification.<init>(TestRMWebServicesAppsModification.java:277)



Mime
  • Unnamed multipart/mixed (inline, None, 0 bytes)
View raw message